program: Gaussian 09
title: 000271256
version: EM64L-G09RevD.01
frameworkgroup: C1[X(C5H4F6I2)]
method: RPBEPBE
basis: SDD
operation: Freq
keyword: #pfreq=noraman
keyword: PBEPBE/SDD
title: #p freq=noraman PBEPBE/SDD
converged: YES YES NO NO
title: Mulliken charges:
elementType: I I F F F F F F C C C C C H H H H
charge: 0.155251 0.155394 -0.144707 -0.144735 -0.172287 -0.145757 -0.172394 -0.145729 0.247171 0.374256 0.374211 -0.848619 -0.848385 0.333812 0.324432 0.324497 0.333588
chargesum: 0.00000
title: Mulliken charges with hydrogens summed into heavy atoms:
elementType: I I F F F F F F C C C C C
charge: 0.155251 0.155394 -0.144707 -0.144735 -0.172287 -0.145757 -0.172394 -0.145729 0.247171 0.374256 0.374211 -0.190375 -0.190300
polarizability: 1.37363973e+02 1.21661783e-02 8.26191922e+01 -8.92745407e+00 -1.03903202e-02 6.59301254e+01
1716.lowfreq: -3.1203 0.0005 0.0007 0.0009 4.1560 8.0309 23.0168 48.4671 53.8590
frequency: 22.9737 48.4542 53.8413 64.9956 97.6803 116.7128 130.7264 155.9557 178.4756 260.3269 269.2199 290.9929 292.3391 316.3001 353.5015 397.1215 400.7781 477.6654 500.2068 549.5121 603.0121 616.2546 666.7005 697.8591 802.9622 806.9634 867.7667 945.6877 955.7230 976.0946 1028.3651 1113.2045 1120.4984 1144.8210 1167.8350 1195.7599 1223.0458 1241.6621 1243.6285 1431.5847 1432.5399 3089.5964 3089.7530 3175.2904 3175.4814
redmass: 31.7395 6.8868 7.1110 7.0939 15.2046 17.5676 8.8373 25.5152 11.4448 15.3593 15.0581 14.4405 15.5766 5.3720 3.2941 9.9636 5.3646 10.4461 9.3519 9.7541 6.8206 6.7300 8.0834 8.9173 1.9349 1.8403 7.4808 2.5993 2.9609 3.7312 11.6883 5.2560 10.0808 5.0422 6.1018 1.3959 1.5471 1.3807 1.3926 1.1036 1.1024 1.0574 1.0574 1.1078 1.1079
irintensity: 0.0002 4.7112 0.3387 2.9265 0.8617 0.1702 0.2423 3.8299 0.0006 10.1765 0.1362 2.1854 0.6958 1.4367 0.4482 5.1296 0.8682 0.0670 15.8207 17.0145 88.1034 3.0593 39.8553 0.9689 2.3735 2.7995 107.0036 69.7689 200.9154 4.1239 132.8913 67.1705 64.0167 2.9327 86.4733 22.2674 32.8307 12.3892 10.8618 40.7935 1.2651 3.5623 0.9329 3.5916 3.4635
temp: 298.150 k
press: 1.00000 atm
elementType: 53 53 9 9 9 9 9 9 6 6 6 6 6 1 1 1 1
symmnumber: 1
zpe: 232014.9 jmol-1
zpe.correction: 0.088370 hartree
zpe.thermalcorrener: 0.102826 hartree
zpe.thermalcorrenthalpy: 0.103771 hartree
zpe.thermalcorrgfe: 0.042398 hartree
zpe.sumelectzpe: -813.968465 hartree
zpe.sumelectthermal: -813.954008 hartree
zpe.sumelectthermalent: -813.953064 hartree
zpe.sumelectthermalfe: -814.014437 hartree
dipole: -0.0116 -1.0380 -0.0009
dipole: 1.0380
quadrupole: -100.8190 -107.5851 -104.4049
quadrupole: -0.0222 7.1388 -0.0057
quadrupole: 3.4507 -3.3155 -0.1352 -0.0222 7.1388 -0.0057
hfenergy: -814.0568345 hartree
pointgroup: C01 [X(C5H4F6I2)]
dipole: 0.0045012 -0.4083658 0.0002016 debye
dipolederiv: -0.1269275 -0.0718481 -0.0270873 -0.0865901 -0.0262947 -0.019029 0.0011861 -0.002388 -0.0079975 -0.1265715 0.0718528 -0.0268896 0.0864916 -0.0262786 0.0188378 0.0015263 0.0021563 -0.0078545 -0.4327951 0.0463084 -0.087222 0.1456502 -0.4861636 0.2668352 -0.170275 0.1842857 -0.5380323 -0.433407 -0.0463511 -0.0878339 -0.1454028 -0.4847571 -0.2667945 -0.1713581 -0.1840179 -0.5395894 -0.5106186 0.0736883 -0.0793976 0.16873 -0.4749802 0.1792954 -0.2453027 0.2031124 -0.4822541 -0.5493161 0.2181876 0.0902986 0.1181271 -0.4838949 -0.1176927 0.1215942 -0.2001788 -0.3576851 -0.5133829 -0.0747103 -0.0802265 -0.1703601 -0.4751273 -0.1790417 -0.2467275 -0.202997 -0.4813146 -0.5489526 -0.2173292 0.090436 -0.1176592 -0.4832777 0.1178464 0.1222441 0.2007962 -0.3583387 0.8125702 0.0004027 0.2400302 -0.0003091 0.9080722 0.0000024 -0.0432845 -0.0000096 0.9493727 0.9261939 -0.3681483 0.0122588 -0.1881942 0.9258398 -0.0264813 0.4116239 0.1629143 0.9066041 0.9280561 0.3677812 0.0135686 0.1897287 0.9254434 0.026037 0.4127747 -0.1640764 0.905645 0.2332721 0.1902687 -0.1070133 0.222536 0.0025155 -0.0810284 -0.1310908 -0.1014928 -0.202864 0.2327384 -0.1902042 -0.1082411 -0.2224 0.0030532 0.0812315 -0.1327901 0.1018525 -0.2021864 0.0186852 0.0027288 0.0542276 -0.0495992 0.0696086 -0.0008144 0.0434208 -0.0132803 0.114247 0.0366208 -0.0868089 0.0241513 -0.0460435 0.0183311 0.060206 -0.0086038 0.0325069 0.0940746 0.0366164 0.0867212 0.0243072 0.0459285 0.0183377 -0.0601569 -0.0085911 -0.0325542 0.0942216 0.0172182 -0.0025396 0.0546331 0.0493662 0.0695726 0.0007475 0.0436535 0.0133707 0.1139516 unknown
polarizability: 138.3601202|-0.0134629|82.6190711|2.7474583|0.0466365|64.9340991 unknown
InChI: InChI=1S/C5H4F6I2/c6-3(7,1-12)5(10,11)4(8,9)2-13/h1-2H2
charge 0 multiplicity 1
17 atoms
I  -3.781701 -1.744021 -0.697904
I  3.781589 -1.745389 0.691606
F  -0.203777 1.62405 -1.120222
F  0.204064 1.620433 1.125844
F  -1.028566 -1.086102 1.155341
F  -2.252688 0.820918 0.852558
F  1.022281 -1.087698 -1.153469
F  2.248843 0.81864 -0.856006
C  -0.000529 0.777197 0.001572
C  -1.331821 -0.047958 0.206236
C  1.329475 -0.049135 -0.206091
C  -1.933844 -0.620889 -1.067572
C  1.935284 -0.621355 1.066288
H  -1.239471 -1.320227 -1.549731
H  -2.201195 0.19417 -1.754331
H  2.205171 0.194138 1.751548
H  1.242286 -1.320071 1.551233
