program: Gaussian 09
title: 000271252
version: EM64L-G09RevD.01
frameworkgroup: C1[X(C13H6BrNO3)]
method: RPBEPBE
basis: SDD
operation: Freq
keyword: #p
keyword: freq=noraman
keyword: PBEPBE/SDD
title: #p freq=noraman PBEPBE/SDD
converged: YES YES NO NO
title: Mulliken charges:
elementType: Br O O O N C C C C C C C C C C C C C H H H H H H
charge: 0.134033 -0.124217 -0.195870 -0.168697 -0.001975 0.330535 0.283381 0.245621 0.229611 -0.258321 -0.415792 -0.584218 -0.377298 -0.412367 0.553356 -0.365805 -0.216359 -0.222493 0.262375 0.250398 0.286413 0.286210 0.238455 0.243024
chargesum: 0.00000
title: Mulliken charges with hydrogens summed into heavy atoms:
elementType: Br O O O N C C C C C C C C C C C C C
charge: 0.134033 -0.124217 -0.195870 -0.168697 -0.001975 0.330535 0.283381 0.245621 0.229611 -0.258321 -0.153417 -0.584218 -0.126900 -0.125954 0.553356 -0.079595 0.022096 0.020531
polarizability: 3.11690814e+02 -2.65646149e+00 2.01087751e+02 -2.11991603e-01 -4.55931325e+00 6.76793279e+01
1716.lowfreq: -6.1626 -0.9472 -0.0002 0.0003 0.0004 4.2850 49.4936 51.8207 59.1710
frequency: 49.4926 51.8194 59.1707 123.4573 126.3836 155.6865 160.9098 212.6691 226.8873 254.9386 288.0727 302.1040 338.7867 413.3343 435.5763 482.5076 497.2704 512.3000 534.3445 576.6961 608.5876 648.0548 649.5224 663.1456 705.4388 740.5049 754.8022 757.8333 781.0407 831.7607 838.2791 856.0782 904.7236 932.0277 972.3735 975.2583 1002.8597 1006.0943 1034.5530 1081.6474 1114.3998 1142.8080 1152.6018 1174.0849 1187.4205 1209.1651 1255.6480 1295.8772 1350.3824 1368.6632 1386.2299 1416.0196 1435.9764 1452.1156 1468.3448 1566.7825 1587.3822 1605.3816 1611.1592 1640.7731 3135.5720 3146.6101 3157.6416 3158.7888 3172.2471 3180.6080
redmass: 9.8292 12.4360 9.8482 8.1658 5.0086 7.0634 16.5377 6.5087 7.9120 16.2808 6.8859 8.8229 8.1618 3.4708 4.8426 7.3928 3.7918 7.3780 7.6841 8.3138 5.2366 6.6544 7.9969 5.9167 4.5891 8.7391 7.2992 1.7617 2.7005 7.7692 3.9754 1.5143 1.5428 8.3370 1.4427 1.4114 1.3633 3.9590 2.6978 2.7050 3.2051 1.9832 1.8524 1.2492 2.0793 11.4813 2.2788 1.7471 4.9153 5.3930 6.2805 3.1060 4.2484 2.6423 4.0143 7.6776 7.9112 7.1637 7.6456 11.4479 1.0868 1.0903 1.0922 1.0924 1.1004 1.0961
irintensity: 2.6210 1.2696 0.8845 0.5865 2.6576 0.9548 0.8319 0.2515 0.5400 0.8037 0.1576 2.7586 4.1509 0.4099 5.3815 1.3381 1.0813 5.2069 3.6940 12.0614 0.7867 12.1403 4.9264 8.8712 1.1126 15.4199 9.2420 65.4317 34.1475 16.5918 4.7166 30.3074 0.6426 75.1407 3.4227 0.9818 0.0610 6.9096 13.4065 11.9213 26.2230 3.7890 7.4604 30.5298 58.6442 354.2916 9.9072 4.8485 30.5771 12.7365 80.9255 90.2071 4.7096 5.9485 4.8736 143.3658 134.8382 8.3090 75.9332 97.6883 1.1326 4.4237 0.5530 12.5446 28.2793 1.4680
temp: 298.150 k
press: 1.00000 atm
elementType: 35 8 8 8 7 6 6 6 6 6 6 6 6 6 6 6 6 6 1 1 1 1 1 1
symmnumber: 1
zpe: 412231.2 jmol-1
zpe.correction: 0.157011 hartree
zpe.thermalcorrener: 0.171105 hartree
zpe.thermalcorrenthalpy: 0.172050 hartree
zpe.thermalcorrgfe: 0.114399 hartree
zpe.sumelectzpe: -791.562873 hartree
zpe.sumelectthermal: -791.548778 hartree
zpe.sumelectthermalent: -791.547834 hartree
zpe.sumelectthermalfe: -791.605484 hartree
dipole: 7.3153 3.2901 -0.0158
dipole: 8.0211
quadrupole: -107.6370 -106.1165 -114.4901
quadrupole: 9.8803 0.7245 2.3641
quadrupole: 1.7776 3.2980 -5.0756 9.8803 0.7245 2.3641
hfenergy: -791.7198833 hartree
pointgroup: C01 [X(C13H6Br1N1O3)]
dipole: 2.656688 1.7030769 0.0177587 debye
dipolederiv: -0.0674118 -0.2168205 -0.0324277 -0.3797134 -0.416169 -0.035582 -0.0564335 -0.0578433 0.0703854 -0.4946177 0.000437 -0.0038566 0.1272964 -0.8673702 -0.0106338 0.0080982 -0.0124429 -0.2702295 -0.8411906 0.2410162 -0.1129678 0.3028903 -0.4996469 0.2382441 -0.1354668 0.2110372 -0.3825203 -0.7485005 -0.1006977 0.1309042 -0.2523669 -0.3864367 0.2326133 0.0860537 0.2158991 -0.3720694 2.0094592 -0.2200328 -0.0150208 0.0394273 0.6391714 -0.5537701 0.0621562 -0.4551058 0.5559169 0.7329009 -0.1510045 -0.0001531 -0.0781991 0.237667 0.0033489 0.0045231 0.0160957 0.0259034 -0.1318869 0.116433 0.0029984 0.0533347 0.0187541 -0.0014082 0.0085437 -0.0006131 -0.0068605 -1.0805422 -0.0642492 -0.0187203 -0.116485 -0.480772 -0.0261752 -0.0080127 -0.0299395 0.0724345 -0.5984774 -0.2508793 -0.0102213 -0.202567 -0.2206167 -0.0049957 -0.0096276 -0.0031318 0.0363347 1.3715639 0.1459306 0.01449 -0.261333 1.0366924 0.0164215 -0.0260111 0.0131955 0.1212454 -0.6288676 0.2122283 -0.0008109 0.2723194 0.0150554 -0.0003221 -0.0217175 -0.0047675 -0.1431092 0.7191688 0.3977185 0.0323961 0.4876468 0.9733632 0.1050643 0.1813555 0.0922758 -0.1054542 -0.1880817 -0.1585067 -0.0051003 0.0512813 0.1058865 0.0056925 -0.0027474 0.0039511 -0.134292 0.0175931 0.0424949 0.0019049 -0.2007884 0.1390934 0.0037175 0.0059169 0.0039531 -0.1070729 -0.8273469 -0.028526 0.0045597 -0.193578 -0.2558429 0.04839 -0.0137238 0.0121281 0.0388922 0.4177445 -0.0256544 0.0128368 0.268893 -0.0032295 0.0051822 -0.1231419 0.0002453 -0.0694801 0.0933312 0.126253 0.0033263 0.1746546 0.0305955 0.0030437 0.0037053 0.0039697 -0.1232028 0.0872463 -0.0493737 -0.0000923 -0.0720782 -0.1132665 0.0002823 0.0004238 0.0004643 -0.1565447 0.0550384 -0.0793033 -0.0007385 -0.0535107 -0.0233305 -0.0027756 0.0131539 -0.0059728 0.1553118 0.0874606 0.075285 0.001205 0.0241577 -0.0640266 -0.0050087 0.0040862 -0.0050416 0.1544239 0.094583 0.0017773 -0.0000508 0.0594063 -0.0142061 -0.0034233 0.0003388 -0.0037113 0.1601092 0.0643511 0.0430618 -0.0012287 0.0163128 0.0637875 -0.0126879 0.0244907 0.0095145 0.1593009 -0.0360203 -0.0934161 -0.0028374 -0.1127366 0.0027631 -0.0035834 -0.0028687 -0.0034209 0.156688 -0.1074975 0.0358286 -0.0003951 0.0457357 0.0820837 -0.0016342 -0.0030948 -0.0007392 0.1638891 unknown
polarizability: 310.0711364|13.5316302|202.7762014|1.2953885|-3.2144972|67.6105553 unknown
InChI: InChI=1S/C13H6BrNO3/c14-12-10(15(17)18)6-5-8-7-3-1-2-4-9(7)13(16)11(8)12/h1-6H
charge 0 multiplicity 1
24 atoms
Br -2.293687 -2.510019 -0.137579
O  0.907818 -2.76595 -0.068749
O  -4.523126 1.310172 -0.610483
O  -4.451024 -0.5355 0.732616
N  -3.886524 0.390223 0.040491
C  0.376861 0.805724 0.005562
C  1.85595 0.704357 0.009202
C  -0.181773 -0.513949 -0.020527
C  2.213736 -0.672746 -0.017896
C  0.96668 -1.510714 -0.041967
C  -0.451905 1.939946 0.009831
C  -1.573656 -0.715071 -0.018293
C  2.851241 1.697023 0.033042
C  3.554062 -1.086583 -0.020332
C  -2.403323 0.447893 0.004705
C  -1.848551 1.748906 -0.00051
C  4.21053 1.285734 0.02986
C  4.560739 -0.087103 0.003609
H  -0.038095 2.952223 0.019064
H  2.599285 2.762645 0.054815
H  3.804891 -2.151883 -0.041206
H  -2.538269 2.597594 -0.013112
H  5.002411 2.042301 0.048415
H  5.617132 -0.375124 0.001441
