program: Gaussian 09
title: 000026070
version: EM64L-G09RevD.01
frameworkgroup: C1[X(C9H11N)]
method: RPBEPBE
basis: SDD
operation: Freq
keyword: #pfreq=noraman
keyword: PBEPBE/SDD
title: #p freq=noraman PBEPBE/SDD
converged: YES YES NO NO
title: Mulliken charges:
elementType: N C C C C C C C C C H H H H H H H H H H H
charge: -0.597633 -0.351951 -0.184788 -0.517987 0.573339 -0.435933 -0.421712 -0.229610 -0.242625 -0.250780 0.259187 0.247741 0.248750 0.235629 0.272168 0.273780 0.229196 0.223471 0.222649 0.220945 0.226163
chargesum: 0.00000
title: Mulliken charges with hydrogens summed into heavy atoms:
elementType: N C C C C C C C C C
charge: -0.051685 -0.092764 0.062953 -0.033607 0.573339 -0.206737 -0.198241 -0.006960 -0.021680 -0.024617
polarizability: 1.44044421e+02 -1.78425974e+00 9.70962170e+01 6.04815222e+00 1.83581865e+00 6.10625506e+01
1716.lowfreq: -19.4316 -8.9462 -0.0006 0.0002 0.0006 1.1819 50.6164 105.5068 155.1857
frequency: 50.5239 105.4990 155.1716 217.1147 292.7053 333.4690 367.7510 405.1275 430.1708 525.0182 532.2246 573.9341 616.4286 701.8949 747.3040 752.8159 801.5283 842.3685 858.6881 892.4147 924.8674 961.5616 969.1119 988.0350 988.7991 1029.0306 1044.5569 1066.5988 1071.5686 1100.9239 1144.1435 1170.8703 1190.4846 1203.5007 1219.6266 1231.9231 1310.5363 1335.0855 1380.5056 1402.2301 1434.0251 1455.0867 1490.5029 1587.4874 1615.9845 1635.7258 3007.1588 3099.2744 3113.9221 3115.4517 3130.8942 3133.3206 3141.4156 3161.1432 3208.6125 3477.3863 3603.6390
redmass: 3.3330 3.7782 3.1004 1.5992 1.9925 3.0325 3.3852 2.8070 2.3698 2.3690 1.4394 3.4609 6.4121 1.7082 2.2612 2.8711 2.0527 1.2595 3.1513 1.3537 1.7944 1.8968 1.4263 2.8269 1.7427 2.0214 1.2951 1.7643 1.0483 1.5533 2.0505 1.0530 1.1164 1.5467 1.8932 1.4976 1.6822 1.3418 5.2513 1.8254 1.6041 1.8453 2.5268 5.9292 6.1086 1.1009 1.0873 1.0564 1.0852 1.0875 1.0910 1.0897 1.0959 1.1014 1.1159 1.0442 1.0994
irintensity: 0.8456 0.6514 0.6601 26.4620 24.2074 9.4516 2.8719 0.0949 10.5900 29.6469 242.9469 4.9631 0.5188 48.8198 14.1922 27.3008 11.1869 0.2368 29.5567 3.0475 7.0812 4.3239 1.1899 0.0665 0.0794 5.7325 8.2028 6.8854 12.5208 9.1337 2.6039 0.2591 1.4391 23.2403 0.6016 8.4710 2.7009 4.6312 3.6767 21.9725 8.3621 25.9714 49.4928 1.5906 31.9933 24.5394 52.8428 13.3790 13.3742 2.3021 5.7326 12.3767 53.3434 23.9124 12.3029 0.2431 2.3290
temp: 298.150 k
press: 1.00000 atm
elementType: 7 6 6 6 6 6 6 6 6 6 1 1 1 1 1 1 1 1 1 1 1
symmnumber: 1
zpe: 462638.7 jmol-1
zpe.correction: 0.176210 hartree
zpe.thermalcorrener: 0.185325 hartree
zpe.thermalcorrenthalpy: 0.186269 hartree
zpe.thermalcorrgfe: 0.141867 hartree
zpe.sumelectzpe: -403.537196 hartree
zpe.sumelectthermal: -403.528080 hartree
zpe.sumelectthermalent: -403.527136 hartree
zpe.sumelectthermalfe: -403.571538 hartree
dipole: 1.0539 -0.5399 -0.8928
dipole: 1.4830
quadrupole: -51.8400 -55.3432 -61.5865
quadrupole: -2.0957 -2.1118 -0.0476
quadrupole: 4.4166 0.9133 -5.3299 -2.0957 -2.1118 -0.0476
hfenergy: -403.7134055 hartree
pointgroup: C01 [X(C9H11N1)]
dipole: 0.4046777 -0.0450275 -0.4179036 debye
dipolederiv: -0.725334 -0.1879194 -0.025207 -0.2644627 -0.3220075 -0.1092234 -0.1265556 -0.1419792 -0.6641561 -0.4926697 0.0962924 0.075533 0.288867 0.010052 -0.0364206 0.2885194 -0.0599672 0.04897 0.7778481 0.1954792 0.0065856 -0.0350963 0.2870996 0.0337287 -0.0526477 -0.0129497 0.2113744 0.0471591 0.0492563 0.0372891 0.0538747 -0.1187379 0.1035238 -0.2104894 0.1594155 -0.0397115 0.7358596 -0.0927835 0.0305346 -0.0176342 -0.0638221 -0.0352632 0.1457585 -0.0424148 -0.0372612 -0.277936 0.0540333 0.0368091 0.1395207 -0.0256713 0.1249512 0.0828071 0.1132604 -0.0705439 -0.1882977 -0.0235365 -0.0008071 -0.1968205 -0.0237477 0.0773327 -0.1531493 0.1000581 -0.1241644 0.0935241 -0.0575493 0.0022555 -0.0663386 0.0286802 0.106186 -0.0005846 0.1106402 -0.0658501 0.0360996 -0.0103298 0.0304485 0.0633951 0.0238606 0.1327646 0.0734564 0.121679 -0.0516053 -0.0118411 0.000554 0.0485171 -0.0389909 -0.144857 0.026242 0.0081907 0.0308563 -0.159779 -0.0046422 0.0176928 -0.0144274 -0.0138082 -0.0272521 -0.0983564 -0.0374404 -0.0818607 0.0386326 -0.1169578 -0.1094085 -0.0794795 -0.0576766 0.0240651 -0.0541066 -0.0686135 -0.0416098 -0.1373429 -0.0448412 0.0414578 -0.117678 0.0370822 0.0673614 0.0122726 -0.0763908 0.0375443 0.0274554 0.0296896 -0.1071286 -0.0269802 -0.0535274 -0.0637775 0.0201655 -0.0227676 -0.0303452 0.0781737 0.0477523 0.0322505 0.0835884 0.0683138 0.1187925 0.0045163 0.2153298 -0.0006757 0.2891541 0.1425448 0.0057306 0.0180214 -0.0105352 0.119445 0.1319348 0.023674 0.1761295 0.2319202 0.0397433 -0.0735847 -0.0770704 -0.0536457 0.0126908 -0.1070688 -0.0605353 -0.1105153 0.0537734 0.016705 0.1064593 0.0450831 0.1031273 -0.0028874 -0.0773422 0.0533093 -0.0734768 0.0932918 0.0019667 0.0992792 0.0403058 0.1118551 -0.0114615 -0.0970563 0.0476128 -0.0985168 0.0940724 0.0326939 -0.0521423 -0.0615576 -0.0706479 -0.0002782 -0.1237495 -0.0773517 -0.120285 0.0539941 -0.1390663 0.0158972 -0.0517641 0.0131483 0.1124529 -0.0350312 -0.052132 -0.0349872 0.1296023 unknown
polarizability: 143.1826489|-8.6037062|87.903992|4.3140815|16.1269552|71.1165478 unknown
InChI: InChI=1S/C9H11N/c10-9-6-8(9)7-4-2-1-3-5-7/h1-5,8-9H,6,10H2
charge 0 multiplicity 1
21 atoms
N  3.597635 0.455601 -0.56181
C  1.322461 0.077567 0.562452
C  2.364015 -0.293581 -0.528769
C  2.140892 -1.229447 0.656283
C  -0.142762 0.081097 0.274084
C  -0.962134 1.102867 0.827077
C  -0.762077 -0.8970 -0.553164
C  -2.348709 1.149589 0.565081
C  -2.147694 -0.84976 -0.819809
C  -2.950005 0.173081 -0.262341
H  1.665858 0.872676 1.232445
H  1.913832 -0.616412 -1.484027
H  2.928023 -1.258946 1.414689
H  1.615353 -2.174086 0.487819
H  4.441507 -0.090206 -0.751014
H  3.562235 1.343897 -1.066745
H  -0.504619 1.865304 1.469942
H  -0.161888 -1.705144 -0.989426
H  -2.959341 1.946168 1.005807
H  -2.60435 -1.613222 -1.460462
H  -4.025832 0.206857 -0.46711
