program: Gaussian 09
title: 000271224
version: EM64L-G09RevD.01
frameworkgroup: C1[X(C13H9BrS)]
method: RPBEPBE
basis: SDD
operation: Freq
keyword: #p
keyword: freq=noraman
keyword: PBEPBE/SDD
title: #p freq=noraman PBEPBE/SDD
converged: YES YES NO NO
title: Mulliken charges:
elementType: Br S C C C C C C C C C C C C C H H H H H H H H H
charge: 0.006685 -0.008319 -0.798450 0.323493 0.331924 0.188891 0.172127 -0.342318 -0.397759 -0.384473 -0.390144 -0.217363 -0.186088 -0.232856 -0.230028 0.311080 0.277684 0.259576 0.247947 0.241672 0.250912 0.230368 0.229670 0.115768
chargesum: 0.00000
title: Mulliken charges with hydrogens summed into heavy atoms:
elementType: Br S C C C C C C C C C C C C C
charge: 0.006685 0.107449 -0.487370 0.323493 0.331924 0.188891 0.172127 -0.064634 -0.138183 -0.136526 -0.148472 -0.217363 0.064824 -0.002488 -0.000357
polarizability: 2.81590592e+02 7.51482386e+00 1.73964499e+02 2.31313352e+00 -1.11298042e+01 8.00867977e+01
1716.lowfreq: -5.4806 -3.9814 0.0007 0.0016 0.0021 3.1784 46.9763 83.8774 101.1059
frequency: 46.9720 83.8765 101.1057 132.1014 142.0991 188.8630 211.1480 230.2861 277.3313 318.1834 323.3083 424.2808 445.0604 459.6378 477.0210 519.2872 562.5140 579.9634 625.2336 636.6282 673.9079 734.8239 742.1109 753.1428 777.0569 830.7244 840.8358 859.2551 877.0693 887.3759 918.9260 954.7554 958.2553 989.9751 993.8922 1024.7350 1054.6504 1096.8448 1121.8304 1158.2340 1170.8849 1180.3061 1194.2888 1203.0496 1234.3575 1276.2088 1300.5178 1366.6718 1384.1918 1416.6660 1436.5940 1457.6260 1477.0273 1577.4626 1591.9512 1607.4291 1619.7429 2435.8995 3027.0047 3126.9744 3136.0982 3140.6531 3148.4481 3164.4494 3165.2186 3172.9161
redmass: 6.9813 6.4328 6.9095 4.5964 4.8119 5.7035 2.7987 1.6440 6.6996 5.0872 4.7779 3.2281 3.1443 6.0990 5.9433 4.8874 3.9584 4.7833 3.4574 6.1800 6.7494 2.6248 5.0950 1.9948 1.7217 1.5904 3.5042 3.0776 1.5615 1.5233 1.7458 1.4410 1.3778 1.3614 6.1204 2.1001 2.0013 2.0828 1.7819 1.2681 1.1513 2.1339 2.2751 1.1662 1.6758 1.5449 1.8708 7.4444 3.8570 3.8934 2.4591 2.7628 4.1107 8.0906 6.8146 7.7608 7.2952 1.0383 1.0842 1.0857 1.0894 1.0898 1.0949 1.0930 1.1002 1.0958
irintensity: 0.0854 0.0149 0.0132 0.2873 0.5998 0.3784 1.5593 20.5710 2.0279 1.6641 0.7070 10.6913 1.4970 10.3711 8.0007 0.3624 3.6198 7.5142 8.4455 3.3618 9.9118 41.9526 19.4165 9.1388 59.9090 20.0146 9.2881 23.5417 4.6029 2.8210 10.5309 2.2835 0.9873 0.4740 11.7451 3.1954 25.4413 3.1926 2.6804 9.6336 0.8630 18.6870 1.7146 0.3231 6.2964 5.1146 0.8581 3.9946 12.0455 41.7321 51.0831 15.3282 6.1442 12.7686 1.3518 7.7506 3.1086 15.2379 0.8257 2.0197 4.0424 4.3947 22.2468 1.8256 33.0579 6.2874
temp: 298.150 k
press: 1.00000 atm
elementType: 35 16 6 6 6 6 6 6 6 6 6 6 6 6 6 1 1 1 1 1 1 1 1 1
symmnumber: 1
zpe: 454855.7 jmol-1
zpe.correction: 0.173245 hartree
zpe.thermalcorrener: 0.185850 hartree
zpe.thermalcorrenthalpy: 0.186794 hartree
zpe.thermalcorrgfe: 0.132823 hartree
zpe.sumelectzpe: -911.291612 hartree
zpe.sumelectthermal: -911.279008 hartree
zpe.sumelectthermalent: -911.278064 hartree
zpe.sumelectthermalfe: -911.332034 hartree
dipole: -2.3964 -1.7463 0.1748
dipole: 2.9703
quadrupole: -99.9546 -98.7256 -104.7342
quadrupole: 1.7965 0.3319 -3.8070
quadrupole: 1.1835 2.4125 -3.5960 1.7965 0.3319 -3.8070
hfenergy: -911.4648575 hartree
pointgroup: C01 [X(C13H9Br1S1)]
dipole: -0.9557174 0.6716941 -0.0330069 debye
dipolederiv: -0.8723775 0.0663788 -0.0225446 0.1458894 -0.0780149 0.006963 -0.0103646 0.0043942 -0.0403545 -0.2811667 -0.0070506 0.0057253 -0.0125294 -0.1291183 -0.1255638 0.000497 -0.2670904 -0.0673379 0.1965254 -0.0063689 -0.0011891 0.0497686 0.2361299 0.1169604 0.0000276 0.3421395 0.2897033 -0.1010773 0.1754786 0.0400507 0.0958058 0.0424113 -0.0296974 -0.0320928 -0.1051477 -0.1126244 -0.1890107 -0.1798539 -0.0373235 -0.2053488 -0.0115282 -0.0242051 0.0468857 -0.0957862 -0.120838 0.2557433 0.117531 -0.0200697 -0.0772053 -0.1012737 -0.0080753 0.010398 0.0087753 0.0225267 0.2545243 -0.1107829 0.0159618 0.0684956 -0.0684343 -0.0129564 -0.0101384 0.0008683 0.0137919 -0.375425 -0.103632 -0.0123428 -0.026835 0.0146478 -0.0272257 0.0161817 0.0058796 -0.0764937 0.0314931 0.0975946 0.0072636 0.1240702 0.0792431 -0.0465762 -0.0285876 -0.0105281 -0.1267587 -0.0021721 -0.0806108 0.0027159 0.0316964 0.0680059 -0.043938 -0.0053243 -0.0201159 -0.1353951 -0.1093238 0.0899249 -0.0004726 0.0214846 0.0700438 -0.0473666 -0.0061071 -0.022665 -0.1406995 1.37836 -0.1286145 0.0357466 -0.343213 0.0901807 -0.029418 0.0270866 -0.0267317 -0.1315735 -0.4272765 0.1490884 -0.0278552 0.2008101 -0.0484903 -0.0245964 -0.0262142 -0.0128649 -0.090989 -0.0271179 0.0138268 -0.0049834 0.1158672 -0.0213713 -0.0174714 -0.012831 -0.0142334 -0.1599342 -0.0135724 -0.0946387 0.0134494 -0.1917776 0.0058652 -0.0390517 0.0303639 -0.0278917 -0.1436799 0.0102063 0.0023657 -0.0035139 -0.0002988 0.0136221 0.0364326 -0.0038371 0.0229965 0.0045795 0.0999858 0.0232371 0.0042332 0.0587467 0.0022235 0.0270013 -0.0033989 0.0111828 0.1465374 0.0825486 -0.0225914 -0.002364 -0.0737583 -0.0525911 0.035785 0.0063069 0.0187238 0.1424728 0.0387313 0.0807328 -0.014081 0.0463689 -0.0575193 0.0298488 -0.0070158 0.0356793 0.1496541 0.0771054 -0.0787592 0.0154588 -0.0369457 -0.0762626 0.0331182 0.0054001 0.0409297 0.1479149 0.0108658 -0.0814502 0.0137983 -0.0818523 0.0200971 0.0226288 0.0162022 0.0237544 0.1561005 -0.1357043 -0.0308723 0.012203 -0.0394397 0.0813723 0.0118258 0.0062718 0.009946 0.1581689 -0.0414013 0.1036695 -0.0138256 0.1240245 -0.0215743 0.026407 -0.0193897 0.0275965 0.1532902 0.1395362 0.0053974 -0.0060416 0.0061757 -0.0576646 0.1291712 -0.0003199 0.0501886 -0.0380617 unknown
polarizability: 281.8729779|-5.1946653|174.813164|-0.0969307|-4.5923364|78.9557464 unknown
InChI: InChI=1S/C13H9BrS/c14-8-5-6-10-9-3-1-2-4-11(9)13(15)12(10)7-8/h1-7,13,15H
charge 0 multiplicity 1
24 atoms
Br 5.051276 -0.155599 0.072307
S  -0.298917 -3.081414 -0.778067
C  -0.321416 -1.561502 0.387321
C  0.85059 -0.608032 0.194758
C  -1.534566 -0.655778 0.221372
C  0.367241 0.71737 -0.021978
C  -1.109307 0.688491 -0.005252
C  2.226423 -0.888292 0.225582
C  -2.899868 -0.979095 0.283007
C  1.27677 1.780627 -0.205255
C  -2.05926 1.720007 -0.166802
C  3.117188 0.192831 0.03991
C  2.66633 1.515518 -0.172992
C  -3.852956 0.057709 0.120712
C  -3.434529 1.394004 -0.101072
H  -0.29878 -2.048524 1.379777
H  2.593056 -1.908333 0.370259
H  -3.220509 -2.014864 0.437905
H  0.927395 2.805341 -0.37055
H  -1.745149 2.755542 -0.338845
H  3.388361 2.324616 -0.314233
H  -4.922727 -0.174543 0.163479
H  -4.185986 2.181645 -0.22531
H  -0.338452 -2.350126 -1.954133
