program: Gaussian 09
title: 000271222
version: EM64L-G09RevD.01
frameworkgroup: C1[X(C15H15NS)]
method: RPBEPBE
basis: SDD
operation: Freq
keyword: #p
keyword: freq=noraman
keyword: PBEPBE/SDD
title: #p freq=noraman PBEPBE/SDD
converged: YES YES NO NO
title: Mulliken charges:
elementType: S N C C C C C C C C C C C C C C C H H H H H H H H H H H H H H H
charge: -0.033205 -0.162289 -0.805692 0.362816 0.180530 0.321022 0.178253 -0.566697 0.428521 -0.417646 -0.404640 -0.402893 -0.372784 -0.243413 -0.232584 -0.646089 -0.646278 0.302462 0.266256 0.234471 0.254348 0.237266 0.236603 0.224220 0.222686 0.113331 0.232806 0.216729 0.232950 0.237554 0.234480 0.216905
chargesum: 0.00000
title: Mulliken charges with hydrogens summed into heavy atoms:
elementType: S N C C C C C C C C C C C C C C C
charge: 0.080126 -0.162289 -0.503230 0.362816 0.180530 0.321022 0.178253 -0.300441 0.428521 -0.183175 -0.150292 -0.165627 -0.136182 -0.019194 -0.009898 0.036396 0.042662
polarizability: 3.17076000e+02 7.58495985e+00 1.93878588e+02 1.93062291e+00 -9.43732167e+00 9.88595285e+01
1716.lowfreq: -4.5971 -3.1611 -0.0024 -0.0023 -0.0020 4.5026 45.8390 60.7820 84.9197
frequency: 45.8359 60.7616 84.9144 106.7068 108.2392 134.5459 143.2424 171.7632 211.4965 230.0718 242.5634 263.4457 296.1632 321.7097 349.3439 430.8796 434.3652 447.8242 474.7382 493.2563 541.0660 554.1579 578.5278 592.3646 645.0597 662.8496 697.5454 735.1783 748.2269 757.0917 775.0582 812.5390 839.0188 856.3197 867.2385 880.7531 910.0721 941.5969 948.0337 960.7668 981.6432 998.5058 1024.9218 1057.2077 1093.8635 1109.9173 1110.8280 1124.1299 1144.9981 1159.7893 1169.0030 1191.1055 1199.0384 1202.7858 1241.6074 1260.7972 1290.9538 1308.6883 1358.8448 1373.6306 1392.3162 1431.2283 1444.2357 1453.5210 1458.9892 1464.5708 1474.0185 1475.4549 1494.2585 1499.8351 1515.7096 1580.0960 1590.7601 1616.9123 1636.5884 2439.8985 2936.5468 2944.9031 3001.0666 3004.4589 3024.7227 3093.8990 3104.2518 3120.9834 3127.3594 3131.4166 3142.9135 3160.0035 3160.8346 3169.8536
redmass: 4.3041 2.9670 3.8719 4.7160 2.2262 2.9175 2.9691 1.9186 1.2777 1.4761 2.1814 2.9023 4.8333 4.4268 3.9980 3.5786 3.2479 3.1475 4.0231 4.7334 4.3959 4.5437 4.1863 3.7617 3.3135 4.6869 5.5484 2.4121 2.4967 2.6958 2.1236 1.6081 3.1303 1.7175 1.7230 2.5136 1.9101 1.3718 1.4562 2.7682 1.3229 4.6664 2.0730 1.4961 2.1026 1.2449 1.3127 2.1259 1.4366 1.3142 1.1411 2.2029 1.8211 1.2005 1.7189 2.9225 1.6057 2.0341 3.1032 7.5159 3.6554 1.1979 2.0915 1.7077 2.6934 1.0407 2.5736 1.0474 1.2978 1.5026 1.5525 7.0943 6.5704 7.2593 7.0915 1.0382 1.0369 1.0395 1.0996 1.1025 1.0844 1.0960 1.0939 1.0852 1.0893 1.0892 1.0949 1.0908 1.0998 1.0929
irintensity: 1.9453 0.6935 1.1371 0.3390 2.2894 0.4938 0.8633 0.2383 0.1944 11.9969 6.7854 3.0359 1.2541 1.4879 2.6725 2.2688 2.7630 1.0132 0.8458 8.0277 3.2019 1.7200 6.3511 10.4556 4.3262 9.4437 3.6509 45.9879 12.9024 10.4708 49.3290 27.1585 17.0954 10.0704 4.6943 9.8644 6.7449 0.2102 3.7829 8.4242 0.0259 1.1357 13.4744 25.1221 9.0161 0.0951 0.9539 19.4804 0.5311 1.1761 0.2879 6.2428 6.4281 0.8397 5.4174 33.2943 3.9540 13.9466 144.6530 14.6544 0.0323 4.9070 80.1829 47.7684 14.8589 0.4179 26.4393 21.4423 2.8383 0.2097 273.4519 25.1591 1.0638 72.1779 248.8113 15.6383 111.0254 122.9498 12.9686 78.0791 2.2351 4.3116 50.2754 4.6704 9.6369 2.5266 29.4562 14.8695 34.8046 22.2446
temp: 298.150 k
press: 1.00000 atm
elementType: 16 7 6 6 6 6 6 6 6 6 6 6 6 6 6 6 6 1 1 1 1 1 1 1 1 1 1 1 1 1 1 1
symmnumber: 1
zpe: 669006.8 jmol-1
zpe.correction: 0.254811 hartree
zpe.thermalcorrener: 0.270406 hartree
zpe.thermalcorrenthalpy: 0.271350 hartree
zpe.thermalcorrgfe: 0.211823 hartree
zpe.sumelectzpe: -1032.207020 hartree
zpe.sumelectthermal: -1032.191425 hartree
zpe.sumelectthermalent: -1032.190481 hartree
zpe.sumelectthermalfe: -1032.250008 hartree
dipole: 3.5884 -1.0461 0.0266
dipole: 3.7379
quadrupole: -84.0200 -105.2136 -110.2098
quadrupole: 1.9126 -0.1529 -3.8980
quadrupole: 15.7945 -5.3991 -10.3953 1.9126 -0.1529 -3.8980
hfenergy: -1032.4618315 hartree
pointgroup: C01 [X(C15H15N1S1)]
dipole: 1.394586 0.4666556 -0.007064 debye
polarizability: 317.4694845|-2.4811601|192.4476557|2.3125366|-13.685015|99.896976 unknown
InChI: InChI=1S/C15H15NS/c1-16(2)10-7-8-12-11-5-3-4-6-13(11)15(17)14(12)9-10/h3-9,15,17H,1-2H3
charge 0 multiplicity 1
32 atoms
S  -0.845991 -3.124348 -0.508517
N  3.946634 0.017976 0.100087
C  -0.897808 -1.503256 0.51783
C  0.261678 -0.551473 0.244953
C  -0.248304 0.737279 -0.094487
C  -2.12809 -0.64125 0.262574
C  -1.721236 0.684885 -0.085539
C  1.634087 -0.810395 0.314362
C  2.566491 0.246307 0.042067
C  0.660629 1.782941 -0.362675
C  -3.486617 -0.983361 0.346943
C  -2.693525 1.675749 -0.348004
C  2.047133 1.542516 -0.294134
C  -4.461012 0.01381 0.083329
C  -4.063573 1.330187 -0.260028
C  4.886422 1.110242 -0.176571
C  4.456921 -1.315702 0.43948
H  -0.87553 -1.901961 1.548914
H  1.979282 -1.819747 0.553982
H  0.302712 2.785668 -0.623541
H  -3.787356 -2.007206 0.595581
H  -2.398712 2.697036 -0.614731
H  2.734214 2.366026 -0.506772
H  -5.52658 -0.234581 0.141363
H  -4.828075 2.08921 -0.462597
H  -0.899205 -2.500511 -1.744041
H  4.764528 1.510773 -1.204097
H  5.918625 0.73841 -0.080239
H  4.761411 1.953058 0.534093
H  4.122268 -2.083266 -0.288093
H  4.128556 -1.639458 1.44859
H  5.558223 -1.299856 0.431821
