program: Gaussian 09
title: 000271221
version: EM64L-G09RevD.01
frameworkgroup: C1[X(C14H12S)]
method: RPBEPBE
basis: SDD
operation: Freq
keyword: #pfreq=noraman
keyword: PBEPBE/SDD
title: #p freq=noraman PBEPBE/SDD
converged: YES YES NO NO
title: Mulliken charges:
elementType: S C C C C C C C C C C C C C C H H H H H H H H H H H H
charge: 0.170169 -0.809837 0.349460 0.349343 0.169315 0.169521 -0.412701 -0.412817 -0.397564 -0.397649 -0.236083 -0.236023 -0.231726 -0.231759 -0.843742 0.297743 0.259489 0.259487 0.239893 0.239903 0.227736 0.227731 0.226451 0.226463 0.274115 0.248975 0.274109
chargesum: 0.00000
title: Mulliken charges with hydrogens summed into heavy atoms:
elementType: S C C C C C C C C C C C C C C
charge: 0.170169 -0.512094 0.349460 0.349343 0.169315 0.169521 -0.153212 -0.153330 -0.157671 -0.157746 -0.008347 -0.008292 -0.005275 -0.005297 -0.046544
polarizability: 2.25391320e+02 1.40246809e-02 1.73683373e+02 5.36655055e-04 -1.81612816e+01 9.83139518e+01
1716.lowfreq: -8.0122 0.0005 0.0021 0.0030 2.1251 11.3322 47.6972 63.6960 97.9001
frequency: 47.4443 63.6641 97.8977 120.6629 137.9516 166.0175 198.1937 203.2580 289.3296 338.2101 410.5551 421.9585 445.6636 461.1583 506.2518 562.4247 575.3554 617.1856 646.3329 651.0080 674.2407 738.8007 747.1496 750.5181 790.8667 796.2060 828.4996 860.1096 883.2966 884.0147 951.1773 951.4513 972.9209 986.7227 986.7336 988.9201 995.2496 1020.2184 1028.7296 1093.0536 1106.5879 1151.2460 1168.1567 1170.3492 1176.6167 1188.7746 1196.3523 1239.6080 1292.5654 1301.9628 1339.1627 1376.3928 1401.9161 1437.4287 1443.3617 1444.6112 1464.9516 1466.3412 1480.5402 1590.8281 1591.7988 1618.0224 1620.1176 3006.7408 3019.5429 3123.6311 3124.6122 3126.1739 3132.2070 3133.2372 3134.5652 3145.3228 3146.2918 3162.1275 3162.8554
redmass: 3.1545 4.1782 4.2772 2.2039 1.4861 4.0769 4.0016 4.2727 4.2832 5.8943 5.4893 3.3579 2.9807 5.1013 4.9484 3.9855 4.5207 6.8955 4.7349 6.2515 5.3417 5.2819 1.7111 1.5323 2.0925 2.5510 3.8661 4.4685 1.4512 1.5785 1.3958 1.4282 1.1836 1.3075 1.3343 1.3294 6.4205 2.2106 1.9851 2.1229 1.7090 1.2501 1.1420 1.1175 1.1390 2.4693 2.3273 1.9893 1.5088 1.9030 1.1314 8.8915 3.4522 2.1985 1.0592 2.8848 1.0554 2.6707 4.0048 7.1404 6.4362 7.4571 7.1477 1.0283 1.0842 1.0853 1.0852 1.1062 1.1031 1.0892 1.0895 1.0949 1.0950 1.1003 1.1003
irintensity: 1.1276 0.1565 0.9995 0.5120 0.5051 1.6479 3.9816 1.7848 0.0002 0.4483 1.1032 7.1071 0.3856 0.0832 0.2640 0.0171 0.0634 6.4294 6.4239 3.4568 18.1932 1.8621 0.0925 153.1705 0.3270 16.2715 1.9255 5.2188 0.1218 0.2973 4.0572 0.3792 5.2492 15.0618 1.0243 3.9266 3.5712 2.1155 6.9768 4.0313 0.5854 1.6506 0.0358 0.0800 1.6640 4.3465 0.4989 2.0084 1.7522 0.8138 1.5007 7.6520 0.7403 32.4992 8.5382 16.5471 15.0362 6.0914 1.3097 0.1681 1.8796 4.5228 0.5976 22.4018 1.1568 2.8403 0.1941 11.7276 7.7611 8.0336 0.1465 0.8177 46.7155 62.8534 6.6853
temp: 298.150 k
press: 1.00000 atm
elementType: 16 6 6 6 6 6 6 6 6 6 6 6 6 6 6 1 1 1 1 1 1 1 1 1 1 1 1
symmnumber: 1
zpe: 559699.2 jmol-1
zpe.correction: 0.213178 hartree
zpe.thermalcorrener: 0.225847 hartree
zpe.thermalcorrenthalpy: 0.226791 hartree
zpe.thermalcorrgfe: 0.173492 hartree
zpe.sumelectzpe: -937.729371 hartree
zpe.sumelectthermal: -937.716702 hartree
zpe.sumelectthermalent: -937.715758 hartree
zpe.sumelectthermalfe: -937.769057 hartree
dipole: -0.0028 -1.2290 0.8859
dipole: 1.5150
quadrupole: -84.8438 -92.9911 -94.8833
quadrupole: -0.0034 -0.0016 -2.5054
quadrupole: 6.0623 -2.0851 -3.9772 -0.0034 -0.0016 -2.5054
hfenergy: -937.9425487 hartree
pointgroup: C01 [X(C14H12S1)]
dipole: -0.0013776 -0.5000891 -0.3243373 debye
polarizability: 225.3732068|-0.6673533|175.2919353|1.2633775|14.3630612|96.7235023 unknown
InChI: InChI=1S/C14H12S/c1-15-14-12-8-4-2-6-10(12)11-7-3-5-9-13(11)14/h2-9,14H,1H3
charge 0 multiplicity 1
27 atoms
S  0.041482 2.9857 -0.153741
C  0.016314 1.311036 0.773978
C  -1.183347 0.431939 0.44583
C  1.202569 0.406817 0.466216
C  -0.739063 -0.852257 0.006481
C  0.738768 -0.867866 0.019296
C  -2.553683 0.729731 0.528398
C  2.577337 0.675232 0.572625
C  -1.674703 -1.84997 -0.343439
C  1.658803 -1.885569 -0.313978
C  -3.492645 -0.272728 0.176494
C  3.50064 -0.347327 0.237462
C  -3.054939 -1.550813 -0.253792
C  3.043368 -1.616035 -0.200125
C  0.053488 2.360673 -1.929067
H  0.010912 1.647382 1.827973
H  -2.88769 1.723801 0.845188
H  2.92708 1.662021 0.895192
H  -1.34521 -2.840118 -0.678077
H  1.314055 -2.868644 -0.654086
H  -4.565771 -0.059079 0.23456
H  4.576905 -0.156627 0.314355
H  -3.795033 -2.313168 -0.522104
H  3.771575 -2.394227 -0.455154
H  0.954943 1.755114 -2.109611
H  0.068089 3.257132 -2.568496
H  -0.855044 1.77165 -2.127782
