program: Gaussian 09
title: 000271219
version: EM64L-G09RevD.01
frameworkgroup: C1[X(C13H9BrN2O4S)]
method: RPBEPBE
basis: SDD
operation: Freq
keyword: #p
keyword: freq=noraman
keyword: PBEPBE/SDD
title: #p freq=noraman PBEPBE/SDD
converged: YES YES NO NO
title: Mulliken charges:
elementType: Br S O O O O N N C C C C C C C C C C C C C H H H H H H H H H
charge: 0.028446 0.365012 -0.190543 -0.185425 -0.201847 -0.192992 0.008285 0.019798 -0.863210 -0.450235 0.485497 0.526208 -0.046451 -0.496016 0.444372 -0.436965 -0.362830 -0.362189 -0.177192 -0.177097 -0.209765 0.281857 0.282624 0.271690 0.339954 0.296115 0.244616 0.244528 0.256863 0.256893
chargesum: 0.00000
title: Mulliken charges with hydrogens summed into heavy atoms:
elementType: Br S O O O O N N C C C C C C C C C C C C C
charge: 0.028446 0.365012 -0.190543 -0.185425 -0.201847 -0.192992 0.008285 0.019798 -0.298729 -0.450235 0.485497 0.526208 0.225239 -0.156062 0.444372 -0.140850 -0.118214 -0.117661 0.079671 0.079796 -0.209765
polarizability: 4.28522711e+02 1.68501284e+01 1.84414464e+02 3.54031240e-01 -4.39860383e-02 1.17548192e+02
1716.lowfreq: -6.9364 -3.4557 -0.0013 -0.0004 0.0014 2.9890 11.1445 22.0991 24.9573
frequency: 10.0106 22.0687 24.9568 45.9986 54.4252 82.1440 87.0120 112.5830 122.9222 159.3132 164.5454 206.8998 215.5228 282.5627 285.7512 295.6398 322.1886 341.5822 364.0754 366.7252 405.0869 440.4145 482.8213 493.1893 504.1245 515.8791 587.3659 601.6139 624.7356 635.7199 649.1466 660.0123 693.7517 712.3742 726.9430 736.5813 756.2978 802.8630 831.7312 832.9922 843.7196 870.6781 893.8400 957.8051 971.2655 975.0137 993.6372 996.7719 1030.5240 1060.4977 1080.3146 1096.4137 1117.8572 1143.3547 1149.5711 1189.6522 1193.2960 1207.4704 1219.0776 1224.9028 1263.6289 1298.5701 1350.0862 1361.5695 1376.4719 1384.0543 1394.5988 1424.2148 1446.7670 1462.8632 1473.2002 1573.1470 1580.5634 1597.3000 1600.4723 3024.9884 3108.4301 3135.7983 3138.0152 3171.8176 3174.7818 3175.2787 3184.5515 3192.9296
redmass: 10.3586 4.1861 14.5634 9.3445 13.7893 7.4202 10.8314 10.6929 12.4920 5.4736 12.9131 10.0233 4.4929 7.5400 8.7312 11.9726 9.7547 11.6344 10.0320 2.5046 2.8523 3.4273 9.6864 3.6570 4.8669 7.7788 6.5712 6.4524 6.8240 4.9644 7.5602 7.9834 10.3018 5.4521 3.4042 5.8717 12.5814 3.8922 1.4320 1.2483 1.7534 8.7448 1.4258 1.3543 1.3795 1.4443 1.3563 4.8865 4.9509 2.6600 1.8512 1.3512 7.6447 1.0927 1.3968 1.1202 11.0320 2.1814 2.3651 2.5762 1.4669 1.2748 4.4062 10.1763 7.0763 10.3735 2.6785 6.9840 1.9051 1.2951 2.3920 8.7938 7.1610 6.1531 7.0182 1.0562 1.1097 1.0902 1.0902 1.0952 1.0964 1.0886 1.0920 1.0961
irintensity: 1.4698 0.0025 0.5886 0.4474 0.1185 2.4445 0.4608 1.5245 0.5000 2.2827 4.1309 8.5024 0.2056 0.7722 11.7013 0.1528 6.1066 1.2344 2.7576 0.8417 0.0002 1.1873 4.2686 27.3926 7.2323 19.0651 14.4457 2.2203 0.1751 8.3216 13.6359 8.5410 9.1226 10.3125 5.9209 1.9938 16.6743 28.3373 22.6867 0.0126 62.2179 27.5422 0.0017 0.4657 0.0330 26.7568 1.5317 78.2048 75.3251 46.3238 30.7892 4.6777 21.3191 3.6720 9.3395 9.3254 391.0173 297.1571 105.6669 0.1649 23.3070 0.0000 56.7818 110.1573 0.3513 94.7655 8.9739 12.6615 74.3149 3.6164 88.7957 34.5481 0.2095 33.8857 184.4733 11.6170 4.3353 6.2319 10.9353 6.1251 0.3020 3.5484 23.4143 4.2681
temp: 298.150 k
press: 1.00000 atm
elementType: 35 16 8 8 8 8 7 7 6 6 6 6 6 6 6 6 6 6 6 6 6 1 1 1 1 1 1 1 1 1
symmnumber: 1
zpe: 522590.6 jmol-1
zpe.correction: 0.199044 hartree
zpe.thermalcorrener: 0.218109 hartree
zpe.thermalcorrenthalpy: 0.219053 hartree
zpe.thermalcorrgfe: 0.146437 hartree
zpe.sumelectzpe: -1321.042660 hartree
zpe.sumelectthermal: -1321.023596 hartree
zpe.sumelectthermalent: -1321.022651 hartree
zpe.sumelectthermalfe: -1321.095267 hartree
dipole: 4.5485 -4.5415 0.0299
dipole: 6.4276
quadrupole: -190.4793 -152.4766 -127.9567
quadrupole: 0.8781 -0.0680 -0.0220
quadrupole: -33.5085 4.4943 29.0142 0.8781 -0.0680 -0.0220
hfenergy: -1321.2417042 hartree
pointgroup: C01 [X(C13H9Br1N2O4S1)]
dipole: -1.777762 1.6678556 0.6729029 debye
polarizability: 428.6022309|16.5090286|176.1804147|-0.4039043|21.6804854|125.7027219 unknown
InChI: InChI=1S/C13H9BrN2O4S/c14-10-3-1-9(2-4-10)8-21-13-6-5-11(15(17)18)7-12(13)16(19)20/h1-7H,8H2
charge 0 multiplicity 1
30 atoms
Br -7.744133 -0.183076 0.037975
S  -0.656187 -0.631372 -0.251064
O  2.903273 -3.145754 -1.28353
O  0.662179 -2.771977 -1.081784
O  5.492712 2.210192 0.671091
O  6.147169 0.164548 -0.10954
N  1.898829 -2.398719 -0.974687
N  5.244037 1.020255 0.231618
C  -1.565217 0.964105 0.371363
C  1.088508 -0.146962 -0.10931
C  -3.046274 0.69159 0.293446
C  2.157326 -1.034213 -0.468211
C  1.469238 1.143732 0.367734
C  3.512444 -0.662342 -0.360207
C  3.825401 0.618201 0.114002
C  2.809486 1.530852 0.481306
C  -3.736229 0.123172 1.394824
C  -3.773072 0.985757 -0.888694
C  -5.122194 -0.138362 1.328655
C  -5.159153 0.73086 -0.972924
C  -5.818551 0.171237 0.141555
H  -1.265848 1.794857 -0.287813
H  -1.23505 1.152301 1.405733
H  0.704679 1.865937 0.657965
H  4.295015 -1.370745 -0.644723
H  3.087181 2.522777 0.847517
H  -3.19138 -0.120436 2.314201
H  -3.25698 1.417078 -1.754188
H  -5.646604 -0.573921 2.183651
H  -5.712004 0.963628 -1.887162
