program: Gaussian 09
title: 000026009
version: EM64L-G09RevD.01
frameworkgroup: C1[X(C9H8ClNO3)]
method: RPBEPBE
basis: SDD
operation: Freq
keyword: #p
keyword: freq=noraman
keyword: PBEPBE/SDD
title: #p freq=noraman PBEPBE/SDD
converged: YES YES NO NO
title: Mulliken charges:
elementType: Cl O O O N C C C C C C C C C H H H H H H H H
charge: -0.046550 -0.284586 -0.395455 -0.246151 -0.417477 0.285980 0.191393 -0.338238 -0.328138 -0.389107 -0.213921 -0.224529 -0.094771 0.170985 0.284750 0.284175 0.347496 0.283037 0.218771 0.260678 0.259100 0.392558
chargesum: 0.00000
title: Mulliken charges with hydrogens summed into heavy atoms:
elementType: Cl O O O N C C C C C C C C C
charge: -0.046550 -0.284586 -0.002897 -0.246151 -0.069982 0.285980 0.191393 -0.055201 -0.109367 0.179818 0.046757 0.034571 -0.094771 0.170985
polarizability: 1.97262008e+02 -9.38312077e+00 1.22349231e+02 -3.05114196e+00 -2.89407845e+00 5.28781442e+01
1716.lowfreq: -8.7499 -2.3882 0.0021 0.0028 0.0028 7.6746 14.3271 42.1496 54.2925
frequency: 13.8344 42.1422 54.2873 67.2636 88.1847 162.6164 180.7991 229.4029 266.0147 285.1435 303.3383 383.2119 405.2761 470.0090 493.9472 497.7735 517.2222 584.7109 591.9236 623.9697 639.5005 675.3366 700.7502 742.0224 810.1601 822.1645 854.2026 916.1675 948.9319 988.8939 991.2757 999.1326 1040.1627 1073.8241 1096.1342 1112.2963 1169.7689 1191.1023 1194.6103 1251.9238 1279.1371 1300.4119 1369.7076 1375.7932 1395.0411 1457.2391 1468.4199 1505.6005 1560.5627 1597.5623 1600.9147 1661.1002 2993.4188 3032.4948 3133.1265 3157.2534 3173.5513 3177.7902 3522.4091 3528.2212
redmass: 4.4585 7.0512 7.3448 6.9901 7.7621 4.0155 5.4295 9.3995 7.7285 6.7822 7.8260 6.4279 2.8322 3.2853 1.9088 6.9481 4.3029 2.1680 1.7800 6.7606 1.3793 4.4740 7.2441 3.3278 6.5446 1.4123 1.5083 3.7193 1.3843 2.0802 1.3736 4.1199 3.9692 2.7214 2.3107 1.4174 2.4626 1.3149 1.0944 1.4979 1.8377 1.3681 4.7677 2.5176 4.1134 1.1836 1.9303 2.3519 8.7866 6.6015 7.4052 8.0050 1.0602 1.0995 1.0896 1.0889 1.0953 1.0971 1.0645 1.0773
irintensity: 0.0575 0.4297 2.3404 3.9611 2.7018 6.8705 10.6319 1.3252 1.1542 3.2032 2.6351 22.0697 1.1190 11.3911 48.6263 9.6768 65.6558 22.1356 32.3563 0.7626 192.7991 16.8594 10.7929 39.8307 17.4046 16.4591 35.9127 30.2559 0.0853 1.2751 3.2853 24.9811 205.8729 10.3282 187.3140 8.2448 11.1744 0.7982 0.0681 20.8718 1.5240 2.2212 16.0786 235.1584 5.6804 82.1375 157.5725 230.3050 100.9061 131.7902 65.8453 147.8111 29.7926 5.1026 12.8546 0.1909 3.8325 2.0191 58.1622 49.8357
temp: 298.150 k
press: 1.00000 atm
elementType: 17 8 8 8 7 6 6 6 6 6 6 6 6 6 1 1 1 1 1 1 1 1
symmnumber: 1
zpe: 411331.1 jmol-1
zpe.correction: 0.156668 hartree
zpe.thermalcorrener: 0.169865 hartree
zpe.thermalcorrenthalpy: 0.170809 hartree
zpe.thermalcorrgfe: 0.113723 hartree
zpe.sumelectzpe: -1087.251962 hartree
zpe.sumelectthermal: -1087.238765 hartree
zpe.sumelectthermalent: -1087.237821 hartree
zpe.sumelectthermalfe: -1087.294906 hartree
dipole: -2.7331 -2.0921 -0.1316
dipole: 3.4445
quadrupole: -75.0018 -92.9164 -89.1432
quadrupole: 8.4276 0.0102 -2.3956
quadrupole: 10.6853 -7.2292 -3.4561 8.4276 0.0102 -2.3956
hfenergy: -1087.4086295 hartree
pointgroup: C01 [X(C9H8Cl1N1O3)]
dipole: -1.0642538 -0.8172947 -0.1893247 debye
dipolederiv: -0.8943867 0.181004 0.0854105 0.2021778 -0.1676845 -0.0250157 0.0904641 -0.0248097 -0.0746719 -0.8264196 0.1830754 0.0587238 -0.0404534 -0.893745 -0.1564497 -0.0180585 -0.1497664 -0.4119527 -1.4752488 0.1399856 0.1000362 0.0747421 -0.2713398 0.0408057 0.0776614 0.0390151 -0.4106947 -0.8476362 -0.0197674 0.0225865 0.1766305 -0.8288211 -0.1795608 0.0803985 -0.1653607 -0.3691913 -1.2175801 -0.2702537 -0.0619898 -0.5603787 -0.6317223 -0.022319 -0.1458961 -0.0198171 -0.434989 -0.4879385 0.0709319 0.0429675 0.1430946 -0.1174478 -0.0345225 0.0748828 -0.0298299 -0.0236808 1.8745448 0.0474556 -0.026546 0.3451151 1.1405008 0.2684088 0.0634187 0.2413189 0.3030987 0.0988365 -0.0936181 -0.0268908 0.1131792 0.0418364 0.0008703 0.0122385 0.0299226 -0.1005884 0.1078118 0.0352454 -0.0280673 -0.1098162 0.0556176 0.0162359 -0.0750966 0.0127275 -0.1275169 0.5007596 -0.0704111 -0.0279108 -0.3585682 -0.1503294 -0.1306783 -0.1054819 -0.1348302 0.2714845 -0.2919238 0.2035322 0.031508 0.2281041 -0.0849482 -0.0169257 0.0344048 -0.0163019 -0.1130951 -0.4864265 0.0144166 0.0343749 -0.0621586 0.0228304 0.0125831 0.0249045 0.0073113 -0.1043956 1.2917328 -0.2789614 -0.1425178 -0.2574369 0.2319628 0.0460133 -0.1438824 0.0490049 -0.0429836 1.8420631 -0.013854 -0.0891409 -0.0325196 1.0872322 0.2897285 -0.090491 0.2806488 0.3023905 -0.0327985 -0.0193197 -0.0337308 0.095761 0.0629093 0.0657074 -0.0437338 0.0608265 0.0448065 -0.0297344 -0.0376458 0.0208924 0.047121 0.1140498 -0.0212366 0.0863634 -0.012192 -0.0174116 0.3202175 0.0359346 0.012083 0.1861566 0.1979656 -0.0439399 0.0655927 -0.0418132 0.2990469 0.1372332 0.049595 0.0060944 0.0087501 0.0209135 -0.0086211 -0.0096927 -0.0190087 0.155101 -0.0310171 -0.102752 0.0093839 -0.112251 0.0154609 0.0013023 0.0177252 -0.0042046 0.1454382 0.0082574 -0.0704365 0.0077907 -0.0663696 0.039254 -0.0040285 0.0085293 -0.0036218 0.1644013 0.0728944 0.0411304 0.0117385 0.0443974 -0.0259243 -0.017304 0.0146584 -0.0168781 0.1640779 0.3667589 -0.0252869 -0.0067962 -0.0652774 0.1414293 -0.0810535 -0.0189091 -0.0823414 0.3813261 unknown
polarizability: 197.1369428|-6.518154|120.1777833|-9.6011151|11.6175838|55.1746573 unknown
InChI: InChI=1S/C9H8ClNO3/c10-7-3-1-6(2-4-7)9(14)11-5-8(12)13/h1-4,11-12H,5H2
charge 0 multiplicity 1
22 atoms
Cl 5.319388 -0.785429 -0.295499
O  -0.846598 2.033937 0.708871
O  -5.18262 -0.61146 0.148758
O  -3.418487 -2.029628 -0.390496
N  -1.564875 -0.089002 0.148893
C  0.858419 0.372786 0.199293
C  -0.564033 0.837604 0.373466
C  1.865353 1.371705 0.196493
C  1.237774 -0.988254 0.060191
C  -2.964531 0.284561 0.318824
C  3.224398 1.031649 0.044333
C  2.594701 -1.346462 -0.090106
C  3.567553 -0.327635 -0.099726
C  -3.836264 -0.910505 -0.01433
H  -3.240041 1.138374 -0.330729
H  -3.172268 0.620762 1.35297
H  -1.384392 -1.039127 -0.184989
H  1.555792 2.41406 0.322166
H  0.496913 -1.795425 0.089966
H  3.999449 1.803124 0.038993
H  2.889641 -2.394434 -0.191904
H  -5.738872 -1.4057 -0.076339
