program: Gaussian 09
title: 000271212
version: EM64L-G09RevD.01
frameworkgroup: C1[X(C13H8Br2)]
method: RPBEPBE
basis: SDD
operation: Freq
keyword: #pfreq=noraman
keyword: PBEPBE/SDD
title: #p freq=noraman PBEPBE/SDD
converged: NO NO NO NO
title: Mulliken charges:
elementType: Br Br C C C C C C C C C C C C C H H H H H H H H
charge: 0.010676 0.016916 -0.695771 0.417231 0.299471 0.215179 0.160392 -0.417861 -0.347774 -0.420945 -0.376689 -0.197231 -0.212051 -0.229442 -0.236624 0.266072 0.266071 0.263572 0.246435 0.241476 0.271055 0.229451 0.230390
chargesum: 0.00000
title: Mulliken charges with hydrogens summed into heavy atoms:
elementType: Br Br C C C C C C C C C C C C C
charge: 0.010676 0.016916 -0.163628 0.417231 0.299471 0.215179 0.160392 -0.417861 -0.084202 -0.174510 -0.135213 0.073824 -0.212051 0.000009 -0.006233
polarizability: 2.59784017e+02 -3.67384325e+00 2.10154209e+02 4.44823081e-03 1.26829774e-02 6.31341179e+01
1716.lowfreq: -1.9484 -1.1973 -0.0003 0.0003 0.0005 6.1449 70.8441 77.0456 104.4239
frequency: 70.8437 77.0386 104.4235 111.2595 146.9525 194.2291 225.8438 261.1014 261.1862 301.2569 333.0759 423.5866 447.9989 480.1870 525.9589 542.7732 577.7161 583.4069 629.8082 685.0655 689.2162 734.7225 775.6227 776.0982 805.8417 840.1321 864.1422 871.3778 889.5027 931.0294 963.1792 990.3672 1010.3799 1028.7911 1075.0226 1102.9548 1131.8135 1159.5920 1170.6866 1187.3009 1195.6058 1222.3729 1266.1493 1298.2719 1358.0045 1380.1308 1397.4920 1425.1201 1431.2786 1460.1523 1470.5657 1554.3911 1591.5185 1599.1779 1622.4228 2983.9479 3025.8392 3124.3293 3131.2162 3144.2801 3162.7538 3163.5365 3177.5800
redmass: 6.8236 4.3148 9.4351 21.7706 5.2172 3.4939 17.8299 7.5589 2.8563 3.8518 6.9724 2.8491 5.9994 3.3090 4.8507 4.9288 6.3228 3.9211 7.1566 7.8591 2.9948 1.8123 6.0310 1.8022 4.2694 6.0004 1.4482 1.3409 1.5083 1.8127 1.6729 1.3338 4.7595 2.4269 2.3010 1.9705 1.1423 2.2319 1.1664 1.6373 2.2372 1.9847 1.9915 1.5735 4.7422 6.5273 2.8966 1.3871 2.3663 2.7750 3.3465 8.4819 6.5869 9.3210 7.2936 1.0613 1.0987 1.0856 1.0898 1.0947 1.0991 1.0941 1.0931
irintensity: 0.2201 0.0195 0.2370 0.0581 0.0436 1.0018 1.6018 0.9096 5.3848 2.7179 1.3319 4.1670 4.0315 4.3467 1.1349 0.1257 11.4105 13.3361 14.1065 49.0331 5.9341 23.6013 13.0575 62.7106 26.4367 17.2234 20.9475 1.3966 9.6689 2.3166 7.6723 0.0906 11.1122 30.2847 7.9117 9.7376 0.0571 30.5918 2.7239 0.8708 0.2120 2.4817 10.4608 0.7027 27.5664 0.3929 55.9426 17.1645 34.8621 12.5539 7.6695 108.7572 1.2752 81.6137 0.3065 6.1875 4.1556 2.8022 2.3430 26.2031 26.2659 9.5415 0.7485
temp: 298.150 k
press: 1.00000 atm
elementType: 35 35 6 6 6 6 6 6 6 6 6 6 6 6 6 1 1 1 1 1 1 1 1
symmnumber: 1
zpe: 431658.2 jmol-1
zpe.correction: 0.164410 hartree
zpe.thermalcorrener: 0.176688 hartree
zpe.thermalcorrenthalpy: 0.177632 hartree
zpe.thermalcorrgfe: 0.123700 hartree
zpe.sumelectzpe: -526.104332 hartree
zpe.sumelectthermal: -526.092054 hartree
zpe.sumelectthermalent: -526.091110 hartree
zpe.sumelectthermalfe: -526.145042 hartree
dipole: 2.8003 -0.2717 0.0001
dipole: 2.8135
quadrupole: -95.0983 -99.0514 -110.4049
quadrupole: -1.4902 0.0005 0.0006
quadrupole: 6.4199 2.4668 -8.8867 -1.4902 0.0005 0.0006
hfenergy: -526.2687419 hartree
pointgroup: C01 [X(C13H8Br2)]
dipole: -1.1018775 -0.1054098 0.0000394 debye
dipolederiv: -0.1755769 0.1835066 -0.0000002 0.2599888 -0.6634891 0.0000181 0.000244 0.0000734 -0.0312151 -0.432773 -0.3437043 0.0000292 -0.3855528 -0.4364714 0.0000678 -0.0001079 0.0000093 -0.0315611 0.0404424 -0.0447644 0.0000171 -0.0093734 -0.1208758 0.0000269 0.0004572 -0.0000104 0.1409087 -0.3085117 0.2396032 -0.00005 0.5599406 -0.3277999 0.0000352 -0.0002715 0.0000288 -0.0052422 -0.0608857 -0.1593008 0.0000185 -0.1932193 0.102534 -0.0000355 0.0002597 0.0000076 -0.0361236 0.4490033 0.120145 -0.000008 -0.083498 0.1441085 0.0000093 0.0002318 0.0000201 0.0283201 0.1016511 -0.1179664 -0.0000029 0.0545251 -0.1345036 0.0000412 -0.000397 -0.0000199 -0.0034237 0.4900152 -0.3870569 0.000039 -0.5526467 1.199997 -0.0001021 -0.0002115 -0.0000399 -0.1205143 -0.4152093 -0.1737981 0.0000431 -0.2872523 -0.2013776 0.0000178 -0.0001435 0.0000131 -0.1098722 0.0149715 0.1391771 -0.0000323 0.1377031 0.080042 0.0000094 -0.0001943 -0.0000785 -0.1641698 -0.0091449 0.0834477 -0.0000072 -0.0291805 0.0811847 0.0000095 0.0000844 -0.0000152 -0.1443211 -0.4285059 -0.0786661 0.0000292 -0.1764323 -0.5753377 0.0000485 0.0002396 0.0000257 -0.0620273 0.7785268 0.5764409 -0.000102 0.795593 0.770933 -0.0001002 0.0000912 -0.0001 -0.117447 -0.019627 0.0113214 -0.0000218 0.1379709 -0.0049108 -0.0000272 0.000173 -0.0000151 -0.1577207 -0.088827 -0.095113 0.0000296 -0.2219524 0.0280697 -0.0000177 -0.0001129 -0.0000356 -0.1583696 0.0042678 0.0100319 0.000705 -0.0068117 0.0382213 0.0769472 0.001829 0.1050902 0.0105817 0.0043046 0.0100355 -0.0007187 -0.0070456 0.038153 -0.0769674 -0.0022089 -0.105109 0.0105862 0.0966535 0.058959 -0.0000058 0.0377213 -0.023257 0.0000067 0.00001 0.0000016 0.1587671 0.054825 -0.0385211 0.0000008 -0.095209 -0.0823599 0.0000043 0.0000376 0.0000347 0.1546229 0.0723629 -0.0911087 -0.0000013 -0.0482265 -0.0661385 -0.000019 0.0000668 0.0000608 0.1538012 0.0033418 0.0230169 0.0000199 0.0196717 0.1042527 -0.0000026 -0.0000577 0.0000398 0.1634035 -0.1412047 -0.0263919 0.0000336 -0.0289521 0.0844785 0.0000084 -0.0000427 0.0000037 0.1608984 -0.0300996 0.1007064 -0.0000148 0.1222381 -0.035453 0.0000215 0.0000236 0.0000149 0.1601178 unknown
polarizability: 259.3522294|5.894083|210.5859968|-0.0019452|-0.0132989|63.1341179 unknown
InChI: InChI=1S/C13H8Br2/c14-9-6-11-10-4-2-1-3-8(10)5-12(11)13(15)7-9/h1-4,6-7H,5H2
charge 0 multiplicity 1
23 atoms
Br 2.606597 -3.094102 0.000162
Br 3.927914 2.56418 -0.000255
C  -0.560672 -1.819937 0.000168
C  0.657942 -0.913998 0.000074
C  -1.717151 -0.828191 0.000137
C  0.256786 0.460486 -0.000004
C  -1.217635 0.511206 0.000036
C  2.024591 -1.221629 0.000055
C  1.208684 1.501844 -0.000099
C  -3.10109 -1.07061 0.000193
C  -2.10205 1.611384 -0.000008
C  3.006116 -0.200572 -0.000041
C  2.573938 1.143609 -0.000117
C  -3.99097 0.034664 0.000149
C  -3.495046 1.362103 0.000049
H  -0.574925 -2.486033 0.885383
H  -0.574977 -2.486147 -0.884961
H  0.90742 2.553099 -0.000156
H  -3.494181 -2.093735 0.000271
H  -1.726779 2.641166 -0.000086
H  4.070196 -0.449068 -0.000057
H  -5.072725 -0.140225 0.000191
H  -4.196681 2.203607 0.000015
