program: Gaussian 09
title: 000026124
version: EM64L-G09RevD.01
frameworkgroup: C1[X(C12H15N2O3PS)]
method: RPBEPBE
basis: SDD
operation: Freq
keyword: #p
keyword: freq=noraman
keyword: PBEPBE/SDD
title: #p freq=noraman PBEPBE/SDD
converged: YES YES NO NO
title: Mulliken charges:
elementType: S P O O O N N C C C C C C C C C C C C H H H H H H H H H H H H H H H
charge: -0.218032 0.891792 -0.457240 -0.461800 -0.469459 -0.054844 0.000447 0.111777 0.075494 0.214920 -0.218789 -0.214811 -0.317149 -0.304835 -0.378451 -0.210976 -0.220667 -0.658184 -0.653534 0.250141 0.229078 0.226167 0.231442 0.249340 0.262095 0.260928 0.236034 0.207871 0.236048 0.236016 0.209776 0.236757 0.235128 0.237523
chargesum: 0.00000
title: Mulliken charges with hydrogens summed into heavy atoms:
elementType: S P O O O N N C C C C C C C C C C C C
charge: -0.218032 0.891792 -0.457240 -0.461800 -0.469459 -0.054844 0.000447 0.111777 0.075494 0.214920 0.260430 0.242798 -0.067809 -0.042741 -0.117523 0.025058 0.016856 0.021750 0.028127
polarizability: 2.88353386e+02 -1.96584143e+01 1.93655803e+02 -3.75219832e+00 1.69060765e+01 1.41391385e+02
1716.lowfreq: -8.4115 0.0012 0.0016 0.0016 0.7375 5.5687 26.8170 29.3636 38.8228
frequency: 26.4773 29.2187 38.7084 45.0775 56.2113 67.6052 84.0757 98.4467 105.7916 132.2685 175.0822 181.0704 203.8691 220.1692 240.6902 245.6657 261.6848 291.0689 311.4288 334.6547 350.6658 405.2275 415.0183 443.3575 493.6313 507.7890 523.6684 528.4374 541.7273 586.1558 627.2632 672.7966 696.5450 725.9837 726.9434 764.4425 774.0981 789.3382 812.6871 813.4646 872.7808 878.8538 886.6099 891.5978 902.8723 968.1742 970.1844 996.7962 1012.1342 1013.7324 1024.1819 1102.8730 1107.9323 1109.0902 1135.3196 1137.4270 1155.3588 1191.9936 1224.1857 1251.0543 1258.7933 1264.1552 1291.4465 1335.1630 1355.6533 1359.6224 1369.1876 1395.2582 1396.1230 1406.4970 1452.6159 1457.1141 1457.2907 1475.8791 1478.2242 1478.7907 1487.2663 1488.8653 1522.7068 1551.7780 1617.2906 2990.5939 2995.5351 2997.7955 3004.9246 3059.1361 3073.2962 3092.1137 3094.1349 3113.3400 3113.7143 3137.9321 3151.4126 3162.6190 3165.2680 3176.0254
redmass: 3.7424 5.0473 4.1467 4.1001 2.2656 4.0611 3.8260 2.1430 5.9772 5.1533 5.5392 4.8120 3.7599 4.8309 1.6878 1.2877 2.6252 4.9119 6.0072 6.7641 5.3447 6.9814 4.0238 5.8470 4.6262 8.2974 7.6447 8.2407 3.9112 10.8412 9.3499 3.3537 5.7104 8.8708 7.6187 6.4106 1.3833 3.3086 1.0849 1.0955 5.1109 1.6187 6.1542 3.8921 1.4724 1.3662 6.1673 1.3276 2.3370 2.0714 2.8488 2.2447 2.2108 1.8567 1.4261 1.4163 1.2652 1.7951 3.3002 1.1477 1.1416 1.7407 3.0545 4.3313 1.2675 1.2566 2.3168 1.2442 1.2437 4.5525 2.7360 1.0421 1.0397 2.9877 1.1180 1.0651 1.0890 1.0821 8.5492 6.8790 6.5786 1.0547 1.0362 1.0388 1.0574 1.1074 1.1072 1.0976 1.0980 1.1027 1.1023 1.0860 1.0896 1.0929 1.0959 1.1005
irintensity: 0.0495 0.6844 1.2242 0.5596 0.9994 1.2160 1.8187 4.7955 0.3802 6.0225 3.5823 3.0284 1.9276 1.1336 1.0822 0.2778 1.5999 23.8507 0.5724 12.3997 24.2350 28.6655 10.9148 1.6961 0.9709 19.4988 6.4904 15.4074 6.8013 161.4416 80.4892 1.8887 40.5792 83.7311 144.0368 29.1138 85.4373 4.4448 3.8588 4.3836 274.3027 3.1334 52.0535 67.8601 19.6755 3.3682 58.8105 0.1228 170.7759 1.4635 51.5839 7.4264 4.8990 4.0570 3.8683 3.3622 23.1781 28.0728 185.5849 6.0783 0.3392 59.2141 31.1754 121.2216 15.2493 2.6729 13.9744 26.2832 27.8611 23.6885 22.9002 5.4728 17.5221 11.4985 4.2426 3.8227 6.5005 16.9375 165.4796 9.9015 1.4691 21.9095 17.3825 27.5537 24.6942 12.0464 1.8109 21.5870 24.6831 21.0296 38.9997 1.5901 6.8882 5.3297 14.4224 22.4521
temp: 298.150 k
press: 1.00000 atm
elementType: 16 15 8 8 8 7 7 6 6 6 6 6 6 6 6 6 6 6 6 1 1 1 1 1 1 1 1 1 1 1 1 1 1 1
symmnumber: 1
zpe: 672356.4 jmol-1
zpe.correction: 0.256087 hartree
zpe.thermalcorrener: 0.276152 hartree
zpe.thermalcorrenthalpy: 0.277097 hartree
zpe.thermalcorrgfe: 0.204788 hartree
zpe.sumelectzpe: -1539.323440 hartree
zpe.sumelectthermal: -1539.303374 hartree
zpe.sumelectthermalent: -1539.302430 hartree
zpe.sumelectthermalfe: -1539.374739 hartree
dipole: -1.3744 1.0209 -0.3404
dipole: 1.7456
quadrupole: -106.1632 -115.1543 -135.9131
quadrupole: -13.2110 -1.7619 -0.4204
quadrupole: 12.9137 3.9226 -16.8362 -13.2110 -1.7619 -0.4204
hfenergy: -1539.5795268 hartree
pointgroup: C01 [X(C12H15N2O3P1S1)]
dipole: -0.5009792 -0.446054 0.1472705 debye
polarizability: 284.2985755|27.8739217|197.9105776|-1.0070766|16.2670023|141.1914206 unknown
InChI: InChI=1S/C12H15N2O3PS/c1-3-15-18(19,16-4-2)17-12-9-13-10-7-5-6-8-11(10)14-12/h5-9H,3-4H2,1-2H3
charge 0 multiplicity 1
34 atoms
S  2.307287 -0.393722 -2.376339
P  2.419512 -0.112404 -0.341654
O  1.305189 1.137165 0.343553
O  2.326867 -1.444736 0.727745
O  3.843858 0.572898 0.319347
N  -0.585518 -0.209796 -0.072834
N  -2.212711 2.054443 0.613753
C  -1.974116 -0.300686 -0.110105
C  -2.794358 0.842156 0.239145
C  -0.066105 0.969044 0.280485
C  1.669117 -2.706082 0.251181
C  4.380246 1.826698 -0.299035
C  -2.602031 -1.522656 -0.492756
C  -4.215656 0.730466 0.199303
C  -0.875828 2.115026 0.629216
C  -3.998735 -1.605888 -0.524211
C  -4.809259 -0.479014 -0.176802
C  1.713885 -3.658604 1.441077
C  5.765271 2.028186 0.306166
H  0.638308 -2.458042 -0.058128
H  2.23606 -3.090011 -0.617015
H  4.420401 1.696965 -1.398001
H  3.693551 2.656707 -0.050857
H  -1.969529 -2.373756 -0.763463
H  -4.807801 1.610585 0.468107
H  -0.3962 3.054909 0.916962
H  -4.480595 -2.543954 -0.820376
H  1.258778 -4.625513 1.156201
H  2.753985 -3.842226 1.758992
H  1.152695 -3.244615 2.295406
H  6.215245 2.95493 -0.095507
H  5.701464 2.117166 1.403621
H  6.425944 1.180165 0.06016
H  -5.900122 -0.568301 -0.209036
