program: Gaussian 09
title: 000271198
version: EM64L-G09RevD.01
frameworkgroup: C1[X(C12H16NO5P)]
method: RPBEPBE
basis: SDD
operation: Freq
keyword: #p
keyword: freq=noraman
keyword: PBEPBE/SDD
title: #p freq=noraman PBEPBE/SDD
converged: YES YES NO NO
title: Mulliken charges:
elementType: P O O O O O N C C C C C C C C C C C C H H H H H H H H H H H H H H H H
charge: 1.338274 -0.459800 -0.480558 -0.266753 -0.543744 -0.226112 -0.879279 0.096281 -0.338606 -0.329523 -0.713701 0.263468 0.551834 -0.417784 -0.347581 -0.497453 -0.194067 -0.217454 -0.259524 0.226920 0.267109 0.261800 0.202199 0.223919 0.238049 0.248173 0.347853 0.218970 0.269754 0.239373 0.256169 0.236637 0.225957 0.228853 0.230347
chargesum: 0.00000
title: Mulliken charges with hydrogens summed into heavy atoms:
elementType: P O O O O O N C C C C C C C C C C C C
charge: 1.338274 -0.459800 -0.480558 -0.266753 -0.543744 -0.226112 -0.531426 0.096281 0.155423 0.134476 -0.003559 0.263468 0.551834 -0.198815 -0.077828 0.234726 0.031890 0.011399 -0.029177
polarizability: 2.22101122e+02 1.72058757e+01 1.37278734e+02 9.11485104e+00 -6.82042743e+00 1.53059779e+02
1716.lowfreq: -6.3232 -0.0017 -0.0014 0.0011 4.3682 14.2799 21.4921 25.0750 29.6099
frequency: 21.1692 24.8959 29.5034 50.7611 59.0033 100.8722 108.0713 122.6302 156.7335 192.5307 204.9137 219.0038 228.9292 235.5284 248.2840 269.2098 277.1077 304.0077 322.1644 343.1419 396.7106 404.9605 407.0049 411.3569 489.3439 503.8094 533.2876 539.5438 575.8374 578.3402 609.3418 628.7761 667.6500 691.7331 719.4486 759.9447 767.0651 769.9679 824.9341 867.3188 870.8042 894.1023 899.7705 928.0108 936.0747 961.7948 962.4041 980.8866 983.8924 985.2238 1018.2859 1027.0783 1079.4830 1088.5974 1094.6992 1115.1427 1127.5869 1151.2935 1171.6444 1190.3155 1194.5970 1202.4283 1245.6380 1258.3952 1310.3468 1315.2282 1345.8813 1360.1768 1361.9525 1394.0788 1401.9214 1423.0765 1435.2705 1452.0839 1453.5502 1462.9170 1465.4659 1472.5291 1482.4523 1486.5552 1597.7305 1616.1381 1639.5596 2980.3828 2987.5948 2999.3413 3009.4560 3085.2159 3098.1880 3111.7564 3114.8657 3115.6008 3117.6642 3132.5260 3142.4531 3153.1801 3156.2759 3169.8290 3532.1109
redmass: 5.1977 3.8239 6.2189 5.0688 5.7903 1.2894 3.0694 5.6366 4.0301 3.8711 2.9587 1.2344 4.1182 4.2578 3.1796 7.5420 4.6266 5.4265 4.2094 2.4318 3.5885 5.4015 3.7220 8.5490 1.7283 4.1042 4.1493 2.3210 6.1567 3.9939 6.4620 7.2815 8.7159 1.8617 6.6805 2.1988 4.6840 3.8987 1.2613 3.2813 4.4782 1.5299 2.4546 2.8495 4.7415 1.4478 5.2282 1.6135 4.5655 1.4178 1.5782 2.1307 6.3266 2.0331 4.8583 1.2922 3.4795 1.5113 1.0496 1.7111 1.1146 1.5160 1.9783 1.8826 1.7482 1.7229 1.1809 1.7227 1.2220 1.1961 3.1403 1.1802 1.0789 1.0885 1.0509 1.0529 2.0519 1.0540 1.0648 2.3949 5.8963 6.1130 9.7179 1.0668 1.0362 1.0646 1.0294 1.0997 1.1009 1.0999 1.1048 1.0878 1.0973 1.0862 1.0920 1.0957 1.1053 1.1015 1.0754
irintensity: 0.9799 0.1238 1.4725 1.5105 0.9708 0.5904 0.6571 3.4973 1.5523 4.4515 2.8749 1.6006 2.7141 0.4826 2.7100 8.8986 3.8072 5.8098 16.4092 15.6045 0.5478 17.7716 2.5636 81.3918 58.3389 5.7487 13.0356 18.2091 2.9029 1.0655 4.8037 115.8608 102.4081 37.2059 0.8599 38.9660 29.2581 96.2200 0.5897 11.9899 187.9491 17.3762 19.7960 1.9242 4.2696 17.9302 260.7055 3.1792 0.7336 1.9728 34.8312 13.2361 52.7564 29.1663 114.9224 7.4110 191.8625 38.3113 0.8781 74.3529 6.9053 6.1816 49.5716 3.3268 118.5049 20.4200 1.7989 49.5741 0.2989 22.0715 21.1940 12.2937 8.1578 12.0541 18.9555 10.5094 8.3434 18.0668 13.6271 152.7360 5.7497 120.1679 144.3240 32.6583 20.7450 42.8582 29.2983 21.5371 10.3861 2.9512 19.9695 12.9751 8.0611 0.6361 22.4645 21.7870 12.3762 16.8153 27.9883
temp: 298.150 k
press: 1.00000 atm
elementType: 15 8 8 8 8 8 7 6 6 6 6 6 6 6 6 6 6 6 6 1 1 1 1 1 1 1 1 1 1 1 1 1 1 1 1
symmnumber: 1
zpe: 708287.0 jmol-1
zpe.correction: 0.269772 hartree
zpe.thermalcorrener: 0.289315 hartree
zpe.thermalcorrenthalpy: 0.290259 hartree
zpe.thermalcorrgfe: 0.219908 hartree
zpe.sumelectzpe: -1237.516161 hartree
zpe.sumelectthermal: -1237.496619 hartree
zpe.sumelectthermalent: -1237.495675 hartree
zpe.sumelectthermalfe: -1237.566025 hartree
dipole: -1.3648 5.8381 -3.5196
dipole: 6.9522
quadrupole: -97.5350 -128.6551 -117.3165
quadrupole: 3.8431 4.0687 -2.8744
quadrupole: 16.9672 -14.1529 -2.8143 3.8431 4.0687 -2.8744
hfenergy: -1237.7859336 hartree
pointgroup: C01 [X(C12H16N1O5P1)]
dipole: 0.5503087 -2.6519249 -0.3818468 debye
polarizability: 222.2760108|12.5253101|144.6113092|-14.4137213|10.4672653|145.5523151 unknown
InChI: InChI=1S/C12H16NO5P/c1-12(11(14)16-2)8-17-19(15,18-9-12)13-10-6-4-3-5-7-10/h3-7,13H,8-9H2,1-2H3
charge 0 multiplicity 1
35 atoms
P  -0.019495 1.07723 -0.730247
O  0.44183 0.705634 0.903596
O  1.225411 0.338762 -1.695412
O  4.164395 0.089787 -0.483512
O  -0.194495 2.627976 -0.94994
O  3.592682 0.276912 1.762223
N  -1.328978 -0.020477 -1.103014
C  2.142901 -1.042552 0.251605
C  0.941901 -0.671486 1.159209
C  1.748846 -0.981976 -1.245795
C  2.56613 -2.507429 0.577402
C  3.340494 -0.139148 0.610708
C  -2.603423 -0.074795 -0.467435
C  -3.618349 -0.885802 -1.041416
C  -2.871826 0.645128 0.726605
C  5.358759 0.934932 -0.226561
C  -4.883557 -0.977336 -0.424207
C  -4.142874 0.545693 1.330511
C  -5.155571 -0.263696 0.765646
H  0.118883 -1.398205 1.0089
H  1.245616 -0.645091 2.216662
H  2.623132 -1.145812 -1.892098
H  0.980941 -1.759361 -1.438985
H  1.726518 -3.203331 0.396016
H  3.417547 -2.818688 -0.052856
H  2.867681 -2.595278 1.63546
H  -1.259837 -0.467434 -2.021449
H  -3.41903 -1.438874 -1.968118
H  -2.100776 1.277826 1.179321
H  6.009302 0.455991 0.524274
H  5.042425 1.924893 0.140189
H  5.859796 1.013295 -1.200885
H  -5.658491 -1.604908 -0.878595
H  -4.341016 1.10985 2.248618
H  -6.139571 -0.332726 1.240482
