program: Gaussian 09
title: 000271176
version: EM64L-G09RevD.01
frameworkgroup: C1[X(C11H14N2O5)]
method: RPBEPBE
basis: SDD
operation: Freq
keyword: #p
keyword: freq=noraman
keyword: PBEPBE/SDD
title: #p freq=noraman PBEPBE/SDD
converged: YES YES NO NO
title: Mulliken charges:
elementType: O O O O O N N C C C C C C C C C C C H H H H H H H H H H H H H H
charge: -0.451051 -0.421987 -0.266619 -0.197815 -0.200542 -0.466308 0.028197 0.289325 -0.391511 -0.394549 -0.706454 0.164229 0.272844 -0.327094 -0.337273 -0.356213 -0.365534 0.389788 0.244420 0.223398 0.220861 0.227290 0.213384 0.233863 0.271146 0.319785 0.350974 0.328534 0.286778 0.234586 0.292516 0.291031
chargesum: 0.00000
title: Mulliken charges with hydrogens summed into heavy atoms:
elementType: O O O O O N N C C C C C C C C C C C
charge: -0.100077 -0.093453 -0.266619 -0.197815 -0.200542 -0.146522 0.028197 0.289325 0.076307 0.053603 0.011939 0.164229 0.272844 -0.040316 -0.102687 -0.063697 -0.074503 0.389788
polarizability: 2.33631754e+02 1.50371546e+00 1.49921577e+02 9.10610405e+00 8.55257503e+00 9.15439663e+01
1716.lowfreq: -6.1901 -0.5387 -0.0009 -0.0008 -0.0005 10.4988 26.0656 31.9556 51.4948
frequency: 25.5108 31.9464 51.4774 62.9377 73.6530 86.7476 113.6747 133.5713 166.6777 179.6008 185.6982 203.0203 205.0844 239.6048 254.0129 268.9795 286.1201 340.3202 361.1444 370.9443 408.7566 446.3724 449.6128 474.2741 497.3380 518.7881 572.2947 606.0252 624.5010 659.9483 679.8471 692.1884 761.2550 766.4857 788.5003 848.1081 854.9907 876.3342 884.3534 913.2147 941.2405 969.7654 983.7426 987.8269 998.1094 1003.5736 1010.1387 1090.6154 1098.2288 1110.8073 1126.5642 1138.1054 1172.5997 1181.0313 1216.6870 1221.0550 1249.7221 1280.8799 1296.3402 1301.0433 1334.1922 1363.4680 1366.5502 1377.5240 1391.3176 1401.5636 1408.3091 1451.4238 1459.9958 1472.6875 1473.7003 1483.2898 1492.3975 1577.5636 1604.1249 1609.4274 2963.8925 2999.1908 3007.9266 3079.6384 3090.5167 3094.7910 3124.5807 3140.6801 3164.2885 3184.2207 3187.6049 3504.4211 3545.5233 3590.4908
redmass: 5.3469 6.9011 6.7492 7.3727 5.1579 7.5825 5.1739 3.8012 2.3032 1.2746 1.2373 2.3412 4.3115 2.6255 1.7370 4.9129 5.1207 2.9832 3.8337 4.2020 2.8782 3.8119 4.1655 3.8122 6.4899 4.0311 1.4022 3.5715 6.2458 5.7476 6.8552 4.2991 4.8634 4.7463 6.6638 1.7317 2.7469 2.0209 1.6381 1.9237 1.9258 1.9704 3.2978 1.4086 2.9567 2.6421 1.4766 3.4799 1.7852 1.3106 1.5983 1.7098 2.4601 1.3161 3.4042 2.8535 1.8337 2.6394 1.3038 1.3137 1.1937 1.3385 5.5381 1.1993 1.2225 10.6880 3.9952 1.4384 1.0977 1.2586 1.3141 1.2073 1.4061 7.0831 6.6309 7.0404 1.0690 1.0383 1.0576 1.1072 1.0961 1.0966 1.1006 1.0900 1.0899 1.0946 1.0963 1.0762 1.0660 1.0669
irintensity: 0.7590 0.3525 5.3892 1.2571 6.3038 18.0765 3.6039 26.8913 50.0657 86.3762 61.8822 12.6159 23.5268 22.0470 66.0532 1.2330 11.9150 13.6382 4.0141 2.8886 0.1155 6.8947 6.0511 6.8086 3.9198 6.5994 29.0991 25.6514 0.9333 2.0369 6.7079 52.8363 14.3978 5.0922 42.0814 7.0978 14.0830 31.8406 22.7094 3.1967 5.3345 64.5080 41.5173 2.3817 78.4316 9.2447 0.2702 13.5877 13.3989 29.4919 14.6566 27.5141 9.3162 28.0870 267.1294 84.1465 68.2993 34.3624 5.8622 56.9011 14.8989 29.5031 72.9959 26.4712 28.4184 0.1182 49.2167 203.8858 16.8816 25.9704 1.8739 61.0756 74.2477 80.5885 20.5004 21.8193 41.9312 15.5166 36.0642 11.6502 6.4929 49.6233 4.0448 11.0680 1.2375 1.4064 1.6464 14.6948 2.4674 7.7631
temp: 298.150 k
press: 1.00000 atm
elementType: 8 8 8 8 8 7 7 6 6 6 6 6 6 6 6 6 6 6 1 1 1 1 1 1 1 1 1 1 1 1 1 1
symmnumber: 1
zpe: 641720.5 jmol-1
zpe.correction: 0.244418 hartree
zpe.thermalcorrener: 0.262946 hartree
zpe.thermalcorrenthalpy: 0.263890 hartree
zpe.thermalcorrgfe: 0.196247 hartree
zpe.sumelectzpe: -911.746758 hartree
zpe.sumelectthermal: -911.728230 hartree
zpe.sumelectthermalent: -911.727286 hartree
zpe.sumelectthermalfe: -911.794929 hartree
dipole: -2.6239 -0.2678 0.5027
dipole: 2.6850
quadrupole: -140.8573 -109.1289 -111.4576
quadrupole: 1.3529 -0.4871 -1.9206
quadrupole: -20.3761 11.3524 9.0237 1.3529 -0.4871 -1.9206
hfenergy: -911.9911761 hartree
pointgroup: C01 [X(C11H14N2O5)]
dipole: 1.0359985 0.1020944 0.1793808 debye
polarizability: 233.3286979|0.5154253|149.4874465|-11.3916561|-9.8125216|92.2811533 unknown
InChI: InChI=1S/C11H14N2O5/c1-11(6-14,7-15)12-10(16)8-2-4-9(5-3-8)13(17)18/h2-5,12,14-15H,6-7H2,1H3
charge 0 multiplicity 1
32 atoms
O  3.340445 0.939677 2.159662
O  3.652459 -2.60616 -0.420985
O  1.295209 1.771172 -1.079009
O  -5.49669 0.664759 0.255433
O  -5.084985 -1.56708 0.489626
N  1.865532 -0.245522 -0.032025
N  -4.702095 -0.350895 0.289354
C  3.356242 -0.112581 -0.120305
C  3.83136 1.067948 0.779734
C  3.939916 -1.442871 0.427843
C  3.819812 0.125596 -1.574136
C  0.954011 0.689125 -0.504283
C  -0.507632 0.358681 -0.284281
C  -1.427839 1.438089 -0.327176
C  -0.988265 -0.961508 -0.074529
C  -2.803749 1.217163 -0.137991
C  -2.363121 -1.201796 0.113562
C  -3.249212 -0.104005 0.086518
H  3.517351 2.023844 0.32064
H  4.9327 1.04386 0.852553
H  3.584226 -1.604055 1.46836
H  5.039485 -1.375973 0.444448
H  4.914906 0.276139 -1.588193
H  3.596486 -0.753724 -2.200979
H  3.332427 1.014161 -2.003334
H  1.521283 -0.913723 0.664042
H  2.471906 1.404837 2.241005
H  2.685122 -2.622197 -0.637914
H  -1.03737 2.441397 -0.523024
H  -0.303516 -1.816433 -0.094335
H  -3.529789 2.033708 -0.162007
H  -2.758518 -2.208634 0.270125
