program: Gaussian 09
title: 000271172
version: EM64L-G09RevD.01
frameworkgroup: C1[X(C11H11NO6)]
method: RPBEPBE
basis: SDD
operation: Freq
keyword: #p
keyword: freq=noraman
keyword: PBEPBE/SDD
title: #p freq=noraman PBEPBE/SDD
converged: YES YES NO NO
title: Mulliken charges:
elementType: O O O O O O N C C C C C C C C C C C H H H H H H H H H H H
charge: -0.264884 -0.273495 -0.254895 -0.222209 -0.214638 -0.208147 0.015831 -0.196342 -0.207644 0.281135 0.278967 0.147326 -0.472427 0.401961 -0.307259 -0.369988 -0.497010 -0.529767 0.279869 0.274635 0.326492 0.265420 0.291977 0.237575 0.244726 0.252355 0.251531 0.242541 0.226365
chargesum: 0.00000
title: Mulliken charges with hydrogens summed into heavy atoms:
elementType: O O O O O O N C C C C C C C C C C C
charge: -0.264884 -0.273495 -0.254895 -0.222209 -0.214638 -0.208147 0.015831 0.083527 0.066990 0.281135 0.278967 0.147326 -0.145935 0.401961 -0.041839 -0.078011 0.237646 0.190670
polarizability: 2.28477543e+02 -1.86744447e+01 1.56213385e+02 5.36821994e+00 4.22091059e+00 9.18189655e+01
1716.lowfreq: -6.2796 -0.0004 0.0004 0.0005 3.0851 6.4302 23.5587 29.3611 39.2998
frequency: 23.5292 29.2370 39.2880 58.0189 61.3905 92.0696 106.9767 114.7247 124.1537 156.4499 187.6414 222.2127 253.4386 258.4943 279.1334 284.5431 317.5472 343.9687 381.1147 428.3017 480.7242 484.6689 534.8045 540.8617 566.0922 622.8823 648.5702 679.4753 702.3840 731.1757 742.5549 768.6470 771.9941 802.7969 839.4273 850.6825 920.0506 962.1678 975.3517 982.0061 989.1935 1070.6193 1077.9045 1097.7575 1103.0879 1113.7640 1114.1086 1148.0740 1152.9734 1160.0955 1193.1064 1214.2490 1235.9904 1249.4302 1260.2826 1293.5330 1355.1630 1368.8029 1395.2515 1414.3995 1425.6769 1442.6943 1453.4188 1462.4868 1468.2191 1474.4552 1478.5270 1577.1836 1616.2868 1639.4251 2982.9872 3009.7922 3086.2446 3113.9095 3127.1086 3135.8369 3142.9833 3157.1635 3170.6014 3180.2441 3192.1016
redmass: 7.2964 4.2952 5.7599 4.0860 7.5753 1.3146 3.2732 4.6435 6.5477 4.5343 5.3660 2.0077 2.9646 2.5529 3.4002 4.2411 7.8629 6.0941 6.5601 7.0152 7.1057 3.9899 5.4322 4.7801 6.0675 7.1052 5.8241 7.4094 6.3590 6.3298 5.8693 5.8591 7.3275 5.9997 5.0442 1.6335 4.5540 1.6095 8.6216 4.5296 1.3526 1.5654 1.5540 1.2731 1.2508 1.2670 1.9260 1.4445 1.3253 2.6897 2.5473 6.1619 4.3484 1.9218 1.5407 1.2365 4.5885 4.8363 4.0069 3.4456 1.1943 1.5535 1.0500 1.0511 1.0831 1.8483 1.2218 8.0300 7.4922 9.5535 1.0316 1.0295 1.1044 1.1049 1.1004 1.0911 1.0889 1.1051 1.0890 1.0915 1.0972
irintensity: 1.7311 1.7578 0.3262 1.5639 0.3070 0.7311 3.0153 8.3764 0.5671 3.2953 2.5737 1.5158 0.1972 0.8269 7.3615 14.9949 10.1988 4.7132 3.6149 0.0816 4.7650 12.3389 5.2776 0.4357 17.0162 14.2273 8.2684 23.0040 10.7239 15.0105 5.2015 10.1923 8.1130 3.3355 15.7512 48.6078 5.4408 29.2570 42.5853 74.6330 0.9119 24.4683 27.4179 25.9998 10.2151 0.2243 18.4470 11.2548 20.4508 89.0808 17.3293 459.0288 329.0552 26.5828 37.0501 18.0987 33.4654 110.9856 38.6654 27.4883 23.5795 1.2456 14.6047 10.1745 18.9445 41.2745 39.4465 63.3464 71.7081 220.8512 56.9015 29.2636 32.5089 19.5488 20.2694 0.9069 6.4895 11.2756 1.1162 8.9340 2.7986
temp: 298.150 k
press: 1.00000 atm
elementType: 8 8 8 8 8 8 7 6 6 6 6 6 6 6 6 6 6 6 1 1 1 1 1 1 1 1 1 1 1
symmnumber: 1
zpe: 548575.6 jmol-1
zpe.correction: 0.208941 hartree
zpe.thermalcorrener: 0.226599 hartree
zpe.thermalcorrenthalpy: 0.227543 hartree
zpe.thermalcorrgfe: 0.160594 hartree
zpe.sumelectzpe: -930.382980 hartree
zpe.sumelectthermal: -930.365322 hartree
zpe.sumelectthermalent: -930.364378 hartree
zpe.sumelectthermalfe: -930.431327 hartree
dipole: -6.4773 5.6624 -1.7559
dipole: 8.7807
quadrupole: -110.7711 -107.8158 -106.4581
quadrupole: 6.5664 11.6550 -2.2257
quadrupole: -2.4228 0.5325 1.8903 6.5664 11.6550 -2.2257
hfenergy: -930.5919212 hartree
pointgroup: C01 [X(C11H11N1O6)]
dipole: 2.4975454 2.3246782 0.5407993 debye
polarizability: 227.5489829|20.5499938|155.4698793|7.2407769|-9.6594813|93.4910314 unknown
InChI: InChI=1S/C11H11NO6/c1-16-8-4-3-6(12(14)15)5-7(8)9-10(18-9)11(13)17-2/h3-5,9-10H,1-2H3
charge 0 multiplicity 1
29 atoms
O  1.160582 -1.517562 0.758905
O  3.840086 -0.276504 0.784634
O  0.183636 2.824361 -0.399125
O  4.029557 -1.11495 -1.387236
O  -5.031329 -0.785425 -0.214516
O  -3.52996 -2.316444 0.569291
N  -3.834917 -1.140469 0.12799
C  0.996715 -0.03716 0.60391
C  1.823018 -0.813566 -0.401976
C  -0.388492 0.439424 0.257452
C  3.325308 -0.769099 -0.412332
C  -0.70004 1.762357 -0.198364
C  -1.443744 -0.496616 0.358558
C  -2.757499 -0.139382 0.004622
C  -2.035391 2.09407 -0.562494
C  -3.069316 1.156922 -0.466298
C  5.321366 -0.286416 0.898019
C  1.48875 2.910259 0.273119
H  1.56455 0.50773 1.364822
H  1.382631 -1.057003 -1.375472
H  -1.228574 -1.511628 0.7031
H  -2.222094 3.111792 -0.916012
H  -4.098851 1.403329 -0.736741
H  5.528844 0.117822 1.897978
H  5.767861 0.341646 0.109143
H  5.697797 -1.317864 0.799893
H  1.854284 3.918629 0.029687
H  2.202202 2.160392 -0.110145
H  1.377021 2.813257 1.368491
