program: Gaussian 09
title: 000271163
version: EM64L-G09RevD.01
frameworkgroup: C1[X(C11H10Cl2O4)]
method: RPBEPBE
basis: SDD
operation: Freq
keyword: #p
keyword: freq=noraman
keyword: PBEPBE/SDD
title: #p freq=noraman PBEPBE/SDD
converged: YES YES NO NO
title: Mulliken charges:
elementType: Cl Cl O O O O C C C C C C C C C C C H H H H H H H H H H
charge: -0.024600 -0.040281 -0.275457 -0.261185 -0.285733 -0.229809 -0.226062 -0.213399 0.373889 0.277969 0.270093 -0.306286 -0.256165 -0.118682 -0.236602 -0.496228 -0.515333 0.278385 0.270927 0.294689 0.283892 0.245531 0.236449 0.246910 0.240571 0.223428 0.243090
chargesum: 0.00000
title: Mulliken charges with hydrogens summed into heavy atoms:
elementType: Cl Cl O O O O C C C C C C C C C C C
charge: -0.024600 -0.040281 -0.275457 -0.261185 -0.285733 -0.229809 0.052323 0.057528 0.373889 0.277969 0.270093 -0.011598 -0.256165 -0.118682 0.047290 0.232661 0.191757
polarizability: 2.00253961e+02 7.47338687e+00 1.77531254e+02 -4.65122050e+00 -1.86301796e+00 9.02104327e+01
1716.lowfreq: -1.9623 -1.1694 -0.0033 -0.0027 -0.0007 8.8015 22.6495 41.5262 45.8983
frequency: 22.4972 41.5171 45.8969 64.2086 68.7230 90.2139 100.9569 125.7391 130.9273 157.3238 168.0521 182.8184 208.4867 228.9910 257.3548 278.7442 284.7362 330.7522 354.3967 389.2670 424.6085 437.5687 534.2328 543.9494 560.1690 596.3795 652.6497 683.3203 691.6808 740.3812 764.1646 792.9969 806.6551 820.1098 861.2915 901.2609 910.1216 944.0628 983.7604 1062.0719 1074.4838 1087.2497 1107.8635 1114.0700 1135.8715 1148.9047 1149.2189 1179.5799 1206.1218 1240.2511 1258.3199 1283.0103 1347.9615 1375.4495 1400.0729 1420.4867 1425.6390 1451.5477 1453.1663 1457.8744 1462.1352 1475.2428 1561.6556 1588.9741 1634.5203 2979.4453 3007.7919 3081.9332 3111.0313 3132.6132 3134.5052 3149.4884 3155.7673 3167.2711 3182.7717
redmass: 7.5441 5.3041 6.5520 2.5206 3.5605 1.4428 2.0831 5.8830 1.5907 5.1286 5.0578 10.4658 5.3720 4.9052 7.8225 6.4210 4.2284 9.2993 11.0029 8.6515 7.5638 7.5555 6.7336 5.2873 4.2029 5.6990 6.5799 5.5202 8.9929 6.9013 7.4441 6.6470 6.2394 7.0660 1.4049 1.4033 6.3790 9.1927 7.0793 1.3337 1.7139 1.3937 1.2328 1.2629 3.3530 1.3562 1.4311 2.9099 1.8296 3.8460 1.8370 1.2810 4.1531 3.4751 3.9932 1.6810 1.2237 1.8917 1.0499 1.0595 1.0513 1.0547 8.1795 7.9018 9.4099 1.0322 1.0296 1.1028 1.1048 1.1028 1.0915 1.0883 1.1049 1.0926 1.0937
irintensity: 0.7684 0.5643 0.2139 6.3108 0.6990 1.2138 1.2054 0.5941 2.9673 2.2625 0.2444 1.1342 1.7497 5.3514 1.2613 12.0311 14.8859 10.0437 1.2411 10.3557 0.7273 4.3084 9.4871 1.8378 8.5568 26.6111 29.5936 19.7186 23.4468 8.6464 23.0090 31.5426 19.7285 24.3425 24.2911 10.0220 23.1448 45.0151 66.6678 10.2424 2.5845 24.0230 4.0299 0.0304 81.6438 5.1820 23.6119 32.4826 42.0524 130.6971 85.8418 39.0776 21.1697 42.2937 65.8280 28.9755 23.9939 89.6737 17.4055 10.4781 10.4683 10.4095 28.9441 19.8190 224.2261 61.3252 31.3260 26.4855 21.8599 15.3550 5.1762 3.1966 12.1978 2.0448 1.3685
temp: 298.150 k
press: 1.00000 atm
elementType: 17 17 8 8 8 8 6 6 6 6 6 6 6 6 6 6 6 1 1 1 1 1 1 1 1 1 1
symmnumber: 1
zpe: 492773.7 jmol-1
zpe.correction: 0.187688 hartree
zpe.thermalcorrener: 0.205563 hartree
zpe.thermalcorrenthalpy: 0.206507 hartree
zpe.thermalcorrgfe: 0.139037 hartree
zpe.sumelectzpe: -1644.857786 hartree
zpe.sumelectthermal: -1644.839911 hartree
zpe.sumelectthermalent: -1644.838967 hartree
zpe.sumelectthermalfe: -1644.906437 hartree
dipole: 0.8054 3.3696 -1.7963
dipole: 3.9025
quadrupole: -103.3514 -109.5964 -118.4308
quadrupole: 7.6347 -4.8291 -6.0869
quadrupole: 7.1082 0.8631 -7.9713 7.6347 -4.8291 -6.0869
hfenergy: -1645.045474 hartree
pointgroup: C01 [X(C11H10Cl2O4)]
dipole: 0.4340098 -1.2572295 0.7670257 debye
polarizability: 201.1648343|-4.5391513|175.9808574|8.5083588|-4.6135777|90.8499558 unknown
InChI: InChI=1S/C11H10Cl2O4/c1-15-8-6(3-5(12)4-7(8)13)9-10(17-9)11(14)16-2/h3-4,9-10H,1-2H3
charge 0 multiplicity 1
27 atoms
Cl -3.248439 -2.838659 -0.656554
Cl -3.820216 2.644772 -0.114423
O  1.360995 1.580428 1.138822
O  3.775301 0.115493 0.473703
O  -0.257284 -2.232164 0.025394
O  3.846744 1.313016 -1.529721
C  0.893753 0.2806 0.542717
C  1.77217 1.213476 -0.26533
C  -0.568451 0.162006 0.260264
C  3.221127 0.910304 -0.521648
C  -1.12785 -1.129115 0.036909
C  -1.389572 1.314029 0.210848
C  -2.510381 -1.223465 -0.26239
C  -2.757852 1.16867 -0.065872
C  -3.341774 -0.089146 -0.313996
C  5.215888 -0.202558 0.310894
C  -0.419703 -3.219451 1.121822
H  1.389463 -0.602174 0.958417
H  1.311735 1.827632 -1.048075
H  -0.95116 2.292597 0.427973
H  -4.404265 -0.186243 -0.549386
H  5.377078 -0.764609 -0.624199
H  5.469406 -0.809429 1.190593
H  5.80731 0.727686 0.283673
H  -1.412088 -3.700342 1.083781
H  -0.270066 -2.730418 2.102936
H  0.367132 -3.967436 0.945849
