program: Gaussian 09
title: 000271159
version: EM64L-G09RevD.01
frameworkgroup: C1[X(C9H16NO5P)]
method: RPBEPBE
basis: SDD
operation: Freq
keyword: #p
keyword: freq=noraman
keyword: PBEPBE/SDD
title: #p freq=noraman PBEPBE/SDD
converged: YES YES NO NO
title: Mulliken charges:
elementType: P O O O O O N C C C C C C C C C H H H H H H H H H H H H H H H H
charge: 1.322680 -0.470040 -0.467471 -0.589127 -0.269631 -0.226276 -0.486393 -0.023866 -0.443315 0.104005 -0.698068 -0.338756 -0.335773 -0.715719 0.263222 -0.498510 0.278823 0.246762 0.272167 0.221116 0.224766 0.231801 0.223598 0.259759 0.255805 0.223780 0.239393 0.242258 0.224741 0.238684 0.254658 0.234927
chargesum: 0.00000
title: Mulliken charges with hydrogens summed into heavy atoms:
elementType: P O O O O O N C C C C C C C C C
charge: 1.322680 -0.470040 -0.467471 -0.589127 -0.269631 -0.226276 -0.486393 0.254957 0.075614 0.104005 -0.020386 0.144601 0.143812 -0.009328 0.263222 0.229760
polarizability: 1.66505154e+02 -2.22950711e+00 1.32442161e+02 1.44680524e+00 -8.53956362e-01 1.19972961e+02
1716.lowfreq: -0.0010 -0.0008 0.0003 2.9565 4.6689 14.2609 24.7575 31.5243 46.4156
frequency: 24.5969 31.2995 46.3741 54.2473 82.5500 95.5516 130.6377 141.9782 170.2175 194.7465 205.8536 210.5964 223.2035 235.6697 247.3814 269.2731 279.3481 322.8637 334.0151 346.0798 389.5891 399.8109 411.1183 432.6140 504.0582 523.0478 551.2527 581.4451 659.9766 680.6888 720.0229 736.2040 766.0722 832.0575 866.3745 896.4323 901.7200 928.8588 936.7015 962.9412 973.2627 982.5677 1017.7400 1027.7321 1067.7319 1071.1012 1081.1454 1114.7340 1121.5594 1125.5273 1144.7299 1151.2133 1168.0274 1190.1051 1202.5157 1245.8001 1259.5126 1314.7483 1347.7362 1362.8966 1377.9313 1390.8793 1399.6456 1422.5862 1432.7440 1452.8295 1456.6806 1459.0982 1463.3877 1466.5172 1472.1712 1473.3149 1481.2108 1639.1031 2987.0284 2987.2646 3003.1374 3008.1648 3008.7343 3079.0904 3080.6161 3083.8764 3085.5923 3096.9393 3104.0945 3109.8537 3112.9818 3121.4997 3154.0923 3190.3083
redmass: 3.6587 5.0117 4.2873 3.8598 2.6988 1.3174 4.8967 3.9740 3.8541 1.4581 1.5454 1.2596 5.6572 2.9846 3.7300 4.0176 5.5821 4.3109 3.2793 3.3760 3.9112 3.4251 4.1038 5.7500 4.5006 5.9276 4.8936 4.2573 9.3311 9.5237 6.6550 4.4089 5.5176 3.7177 2.9959 1.2905 2.4231 2.9340 4.5959 6.3087 2.3108 1.6020 1.5922 1.2992 5.3571 1.6911 5.8562 1.2861 1.3618 3.2586 1.4608 1.4935 1.7698 1.7195 1.5109 1.7198 1.8557 1.7147 1.1732 1.2128 1.4743 1.1920 1.4848 1.1798 1.0807 1.0494 1.0863 1.0867 1.0539 1.1366 1.0536 1.0470 1.0631 9.7804 1.0358 1.0350 1.0645 1.0395 1.0540 1.0575 1.0973 1.0914 1.0996 1.1009 1.0970 1.1020 1.1047 1.1000 1.1052 1.1179
irintensity: 1.8557 2.7661 0.2991 1.2130 2.4806 0.5147 3.3554 2.4707 5.4195 0.5155 1.7529 0.7256 3.3560 2.2697 2.1693 16.8207 5.1357 14.0459 1.7922 20.7681 20.8077 3.5516 10.3451 15.4562 7.0026 2.8904 26.3225 9.4753 164.3303 93.6061 5.8146 7.0859 4.4073 163.9435 18.4359 7.3698 24.8775 1.9885 6.2468 256.5786 40.9070 6.9501 39.7276 54.3331 113.4777 33.4055 26.3428 4.8915 21.6889 177.9138 6.6123 31.3761 7.9767 57.9821 7.9333 21.7947 2.3543 14.4579 2.2821 0.7632 10.3322 19.7289 31.3047 12.1545 11.4416 13.0636 15.9240 15.0064 8.3822 9.5902 22.1333 8.1146 21.5197 146.9570 18.6685 17.7418 10.6515 62.7458 25.2706 15.1788 12.3353 18.0871 20.0222 12.3719 23.3936 4.7435 21.2328 6.7869 13.1662 5.1013
temp: 298.150 k
press: 1.00000 atm
elementType: 15 8 8 8 8 8 7 6 6 6 6 6 6 6 6 6 1 1 1 1 1 1 1 1 1 1 1 1 1 1 1 1
symmnumber: 1
zpe: 657343.4 jmol-1
zpe.correction: 0.250369 hartree
zpe.thermalcorrener: 0.268770 hartree
zpe.thermalcorrenthalpy: 0.269714 hartree
zpe.thermalcorrgfe: 0.202811 hartree
zpe.sumelectzpe: -1123.319746 hartree
zpe.sumelectthermal: -1123.301345 hartree
zpe.sumelectthermalent: -1123.300401 hartree
zpe.sumelectthermalfe: -1123.367304 hartree
dipole: -0.2453 4.8685 3.6212
dipole: 6.0726
quadrupole: -78.8074 -106.0296 -108.2830
quadrupole: -6.8532 3.5701 -1.9227
quadrupole: 18.8993 -8.3229 -10.5763 -6.8532 3.5701 -1.9227
hfenergy: -1123.5701151 hartree
pointgroup: C01 [X(C9H16N1O5P1)]
dipole: 0.0947676 2.2849629 -0.6913035 debye
polarizability: 166.621765|1.4347856|130.4271368|0.7608883|4.5843466|121.8713737 unknown
InChI: InChI=1S/C9H16NO5P/c1-7-4-10(7)16(12)14-5-9(2,6-15-16)8(11)13-3/h7H,4-6H2,1-3H3
charge 0 multiplicity 1
32 atoms
P  1.08369 -1.045639 -0.259071
O  0.37837 -0.500226 1.229153
O  -0.120622 -0.621084 -1.435617
O  1.481703 -2.577864 -0.268416
O  -3.232238 -0.265447 -0.755593
O  -2.899573 -0.281308 1.544784
N  2.352017 0.181438 -0.543152
C  3.750148 -0.083171 0.014687
C  3.498236 -0.185162 -1.476915
C  -1.338922 0.991428 0.097449
C  4.443971 1.105757 0.645995
C  -0.275145 0.837865 1.215629
C  -0.715562 0.736801 -1.298904
C  -1.871322 2.456296 0.13157
C  -2.535562 0.067854 0.400783
C  -4.419633 -1.13558 -0.563698
H  3.876173 -1.045592 0.531085
H  3.804787 0.632571 -2.136765
H  3.491077 -1.186069 -1.926067
H  5.537447 0.943321 0.670277
H  4.238493 2.026709 0.073672
H  4.095186 1.256569 1.683188
H  0.501149 1.617448 1.092403
H  -0.74368 0.905163 2.20938
H  -1.481367 0.768195 -2.086951
H  0.070446 1.493897 -1.488045
H  -2.641954 2.608834 -0.643897
H  -2.317873 2.685587 1.114934
H  -1.047159 3.170033 -0.051306
H  -5.156325 -0.637202 0.088587
H  -4.112632 -2.089991 -0.105761
H  -4.819121 -1.290632 -1.57522
