program: Gaussian 09
title: 000271143
version: EM64L-G09RevD.01
frameworkgroup: C1[X(C12H19N)]
method: RPBEPBE
basis: SDD
operation: Freq
keyword: #pfreq=noraman
keyword: PBEPBE/SDD
title: #p freq=noraman PBEPBE/SDD
converged: YES YES NO NO
title: Mulliken charges:
elementType: N C C C C C C C C C C C C H H H H H H H H H H H H H H H H H H H
charge: -0.005890 0.008683 -0.434126 -0.212311 -0.372204 -0.741724 0.522728 -0.720983 -0.709714 -0.380707 -0.343336 -0.334720 -0.350945 0.209546 0.194417 0.199674 0.215399 0.196642 0.189120 0.205876 0.217218 0.215094 0.212788 0.217310 0.228250 0.213555 0.213632 0.216076 0.229372 0.227702 0.237320 0.236257
chargesum: 0.00000
title: Mulliken charges with hydrogens summed into heavy atoms:
elementType: N C C C C C C C C C C C C
charge: -0.005890 0.218229 -0.040035 0.003088 0.013559 -0.103536 0.522728 -0.062635 -0.066451 -0.151335 -0.115634 -0.097400 -0.114689
polarizability: 1.40296696e+02 -1.41035968e+01 1.23841540e+02 1.01329432e+01 8.08773140e+00 1.25920309e+02
1716.lowfreq: -13.5516 -0.0005 -0.0002 0.0003 7.6119 14.1723 20.2060 28.1108 53.9913
frequency: 18.2193 28.0340 53.9641 89.7718 127.6337 159.6099 180.7588 196.2623 223.8666 227.0462 245.7926 281.3527 318.7590 368.1797 370.5459 420.2032 457.9412 477.4711 549.5079 571.4886 662.9862 738.5303 753.3723 763.9940 808.8415 826.7781 871.3999 886.5673 889.5781 937.3729 960.0819 961.9950 962.6461 974.3670 995.8668 1024.4316 1028.1632 1055.6372 1063.3359 1071.7637 1092.9727 1131.8942 1142.9957 1167.5433 1212.9652 1213.3196 1224.0601 1259.5361 1282.0794 1295.3697 1301.4517 1320.2686 1323.5339 1345.8044 1350.0114 1358.6869 1385.4343 1387.9109 1391.3844 1406.8799 1456.3756 1463.3749 1464.6732 1471.4149 1475.3504 1478.6038 1478.9729 1483.7783 1487.4711 1555.1136 1586.0888 2957.0847 2959.6006 2966.9914 2971.6297 2975.2457 2976.2275 2988.7407 3013.3452 3024.8800 3061.2462 3069.0641 3070.0616 3072.1141 3073.4217 3079.2855 3119.7996 3122.0901 3141.8713 3149.1518
redmass: 3.5858 2.9920 3.9719 1.7403 2.4975 3.0249 1.3618 1.9299 1.2549 1.3526 1.8244 2.7453 2.8554 2.4678 2.4801 3.0499 2.5290 2.6685 3.0958 2.9181 6.9686 3.1964 3.0424 1.4727 1.7233 1.4615 1.4869 1.2840 1.7600 1.9182 1.5084 3.3298 1.4065 1.4934 1.4422 1.4312 2.8338 2.5174 2.2193 1.7911 1.8220 1.9950 2.2685 2.0002 1.9167 1.4090 1.3659 1.3135 1.4117 1.3948 1.9395 1.2895 2.0656 1.5186 1.4566 1.3298 1.2030 1.2120 1.2089 2.0296 1.0786 1.0732 1.7847 1.0516 1.0616 1.1113 1.0608 1.0456 1.0530 6.4878 5.6285 1.0673 1.0608 1.0506 1.0580 1.0352 1.0383 1.0845 1.1002 1.0992 1.0984 1.0993 1.0991 1.0992 1.0992 1.1001 1.0872 1.0874 1.0960 1.0987
irintensity: 0.0150 0.1955 0.4766 0.0152 0.0972 0.2141 0.0403 0.2909 0.1031 0.3151 0.3846 0.2332 1.3488 0.0052 0.1036 0.7981 0.1752 2.0684 1.5420 26.9698 0.5157 7.8526 2.1711 8.2132 0.8826 45.9791 6.8974 0.7863 1.6403 2.7028 7.6042 5.8068 3.8614 0.1353 12.8876 2.7668 1.8282 1.5875 4.3552 2.0218 2.7635 1.6122 1.2646 1.2158 0.2080 0.9352 4.7885 1.3740 1.2470 1.5721 5.5445 2.7172 2.0919 1.3531 2.8009 4.7013 5.9084 16.7803 20.4458 20.5765 3.7151 2.9346 2.9403 9.1430 6.9834 10.3804 9.4625 14.8003 17.9938 11.5536 53.4138 13.9402 22.6878 16.3168 63.9290 34.4044 22.7667 8.0198 21.4418 51.0309 32.6293 54.8474 48.1880 42.1390 88.3439 35.4714 8.2387 11.7901 56.8609 2.0135
temp: 298.150 k
press: 1.00000 atm
elementType: 7 6 6 6 6 6 6 6 6 6 6 6 6 1 1 1 1 1 1 1 1 1 1 1 1 1 1 1 1 1 1 1
symmnumber: 1
zpe: 738043.8 jmol-1
zpe.correction: 0.281106 hartree
zpe.thermalcorrener: 0.295438 hartree
zpe.thermalcorrenthalpy: 0.296383 hartree
zpe.thermalcorrgfe: 0.238415 hartree
zpe.sumelectzpe: -522.411720 hartree
zpe.sumelectthermal: -522.397387 hartree
zpe.sumelectthermalent: -522.396443 hartree
zpe.sumelectthermalfe: -522.454411 hartree
dipole: -2.6027 1.9464 -0.3357
dipole: 3.2673
quadrupole: -91.9366 -82.6426 -77.0073
quadrupole: 5.6736 0.8130 2.8591
quadrupole: -8.0744 1.2196 6.8549 5.6736 0.8130 2.8591
hfenergy: -522.6928256 hartree
pointgroup: C01 [X(C12H19N1)]
dipole: -1.0428542 0.7501757 -0.0456344 debye
polarizability: 140.9668543|-14.7616427|121.2258309|8.2658829|7.7561879|127.8658602 unknown
InChI: InChI=1S/C12H19N/c1-4-10(2)9-11(3)12-5-7-13-8-6-12/h5-8,10-11H,4,9H2,1-3H3
charge 0 multiplicity 1
32 atoms
N  3.169397 -1.320328 0.073871
C  -2.007003 -0.257357 0.577991
C  -1.552096 0.844771 -0.415699
C  -0.189142 1.527007 -0.095487
C  -3.321382 -0.939478 0.102663
C  -2.192225 0.302636 2.009518
C  0.965477 0.527426 -0.034909
C  0.110936 2.644202 -1.132204
C  -3.201361 -1.736156 -1.215872
C  1.791333 0.419331 1.111875
C  1.279664 -0.322827 -1.128228
C  2.864393 -0.501372 1.124033
C  2.369921 -1.213947 -1.031733
H  -1.218552 -1.039103 0.612404
H  -2.330997 1.635872 -0.450139
H  -1.495356 0.420505 -1.437881
H  -0.267184 2.009627 0.898632
H  -3.661448 -1.627947 0.902771
H  -4.113028 -0.167144 0.002056
H  -2.935734 1.123936 2.017858
H  -1.248149 0.693361 2.429937
H  -2.555139 -0.486539 2.694035
H  0.195349 2.227193 -2.153159
H  -0.703094 3.392528 -1.138162
H  1.058017 3.16371 -0.900445
H  -2.391494 -2.487469 -1.149993
H  -2.985024 -1.081569 -2.079624
H  -4.141576 -2.273485 -1.438738
H  1.604804 1.048126 1.990484
H  0.685057 -0.29905 -2.048455
H  3.51119 -0.595935 2.004179
H  2.626543 -1.876525 -1.866685
