program: Gaussian 09
title: 000271129
version: EM64L-G09RevD.01
frameworkgroup: C1[X(C19H26)]
method: RPBEPBE
basis: SDD
operation: Freq
keyword: #p
keyword: freq=noraman
keyword: PBEPBE/SDD
title: #p freq=noraman PBEPBE/SDD
converged: YES YES NO NO
title: Mulliken charges:
elementType: C C C C C C C C C C C C C C C C C C C H H H H H H H H H H H H H H H H H H H H H H H H H H
charge: -0.175725 0.355806 0.216103 -0.191678 0.216546 0.372253 -0.382738 -0.387544 -0.374252 -0.437801 -0.443809 -0.447746 -0.441450 -0.719154 -0.300949 -0.696384 -0.695844 -0.302184 -0.689538 0.188361 0.196363 0.198868 0.195228 0.196023 0.196600 0.197779 0.196952 0.231045 0.226355 0.224063 0.230819 0.228448 0.211480 0.213352 0.221174 0.235078 0.211627 0.204418 0.211208 0.234587 0.205344 0.221434 0.211280 0.204411 0.233792
chargesum: 0.00000
title: Mulliken charges with hydrogens summed into heavy atoms:
elementType: C C C C C C C C C C C C C C C C C C C
charge: 0.012636 0.355806 0.216103 0.004685 0.216546 0.372253 0.011358 0.005078 0.020480 -0.206756 -0.217454 -0.223683 -0.210631 -0.065874 -0.079775 -0.045261 -0.044705 -0.080751 -0.040055
polarizability: 2.64694834e+02 7.73611842e+00 1.51730940e+02 1.00942839e+01 5.67324562e+00 2.07464916e+02
1716.lowfreq: -9.9083 -6.9625 -0.0007 -0.0006 -0.0004 5.5663 10.5962 20.5050 29.5942
frequency: 5.6205 20.1264 29.5630 69.7558 77.8665 93.0182 126.8368 129.7454 152.9921 156.3181 183.6442 190.3567 202.8929 214.8513 233.3514 239.0365 263.5513 264.6800 300.3509 326.8616 366.0658 401.3504 417.1164 440.2072 469.0543 481.3698 482.0375 529.8497 569.4681 580.4141 583.8187 641.1840 699.0859 738.2165 759.3883 768.6001 782.5469 795.4126 798.5949 809.1940 834.0845 844.1509 862.1951 896.5746 904.0310 912.1803 929.4125 956.5849 977.2362 978.6123 996.0713 1012.1225 1024.9434 1040.3597 1049.4509 1053.1987 1063.8649 1079.5668 1098.2876 1099.9337 1102.5318 1135.6717 1149.3724 1168.5889 1180.4622 1194.9732 1228.2543 1236.7185 1241.3866 1248.1920 1251.8908 1258.7407 1272.0034 1282.7245 1318.2459 1322.7605 1328.1104 1332.8811 1345.0339 1382.3461 1387.2501 1388.7998 1389.5729 1390.4060 1392.2385 1419.3401 1420.4695 1459.5061 1462.0303 1464.9319 1471.5626 1473.5851 1474.3093 1475.1617 1475.4529 1478.7683 1483.0353 1483.7499 1484.4604 1525.2477 1591.8016 1596.0745 1619.3300 2965.4290 2970.2708 2971.1647 2974.5664 2975.7718 2976.5570 2976.8320 3000.0723 3009.4549 3014.7007 3028.7769 3030.9764 3068.1754 3068.2017 3069.2119 3070.9924 3078.4182 3078.8128 3078.9966 3079.5570 3117.3405 3118.4017 3138.5705 3139.4266 3164.9062 3166.4373
redmass: 3.1037 3.6685 3.6222 2.8731 2.2484 2.3311 1.9803 2.4463 2.6114 2.0653 2.7855 1.4169 1.8706 1.0695 1.5377 1.6317 2.0586 2.3011 3.3489 2.9397 2.9321 3.7219 2.9383 2.9407 3.2049 4.9545 4.5173 5.6801 3.7637 2.7514 2.7929 2.6270 3.4739 1.3375 2.5701 1.2075 3.1745 1.6073 1.3289 2.2077 1.5912 4.2372 2.2841 1.9595 1.5558 1.4152 1.8943 1.2506 1.3566 1.3514 1.6032 1.7099 2.6309 1.4937 2.8777 1.7792 2.0679 2.6847 2.3650 2.4085 1.9402 1.7620 2.3533 2.4142 1.1647 1.3046 1.8751 1.7341 1.3010 1.3686 2.3280 1.3099 1.1447 1.2603 1.6923 1.4745 1.4605 1.3965 1.6637 2.1593 1.5969 1.2925 1.2126 1.2302 1.4570 2.7195 2.5548 1.9782 1.1229 1.0646 1.0761 1.0516 1.0421 1.0434 1.0423 1.0822 1.0596 1.0687 1.0682 4.0681 7.6427 5.1331 5.9967 1.0586 1.0547 1.0569 1.0362 1.0376 1.0395 1.0383 1.0857 1.0896 1.1012 1.0940 1.0969 1.0997 1.0997 1.0992 1.0991 1.1000 1.1000 1.0996 1.0998 1.0865 1.0864 1.0915 1.0919 1.0956 1.0951
irintensity: 0.0294 0.0062 0.1146 0.0054 0.0052 0.0082 0.0684 0.1281 0.1404 0.0560 1.0553 0.1825 0.3984 0.1077 0.0567 1.3900 0.0207 0.1424 4.0038 2.0974 2.1501 0.0177 0.3170 1.3131 0.0147 0.4440 7.6410 0.0155 0.0974 2.3590 3.0729 0.0792 1.0098 0.0589 24.7028 1.1358 4.4500 6.7575 105.8172 2.7719 6.7766 0.4020 1.6256 3.2032 4.2328 0.3014 0.8548 5.7191 0.2536 0.6270 19.9027 0.4601 2.1903 11.1564 0.2997 0.8599 6.1477 1.9173 8.7018 0.6758 5.8748 0.9680 5.5991 1.0665 0.0459 0.6055 1.7857 8.1842 0.0160 2.0106 0.4732 0.1674 0.1059 1.0131 5.6419 1.1399 4.7105 9.3946 1.1453 2.1956 10.6518 4.5875 15.0453 2.6677 18.4722 4.9409 19.7626 0.7130 0.6027 2.8546 6.3490 4.6938 15.9994 9.6641 18.3275 3.7423 9.1633 16.2072 14.7460 14.9514 0.0904 10.1210 0.0182 5.4453 25.8630 91.2760 70.3161 48.0055 17.8218 10.1491 13.5915 7.8833 0.3007 19.1785 50.7578 43.6856 12.4258 62.9702 60.2749 19.7545 100.5069 37.1190 69.5531 16.2485 7.6714 16.7697 30.7858 42.4717 13.0371
temp: 298.150 k
press: 1.00000 atm
elementType: 6 6 6 6 6 6 6 6 6 6 6 6 6 6 6 6 6 6 6 1 1 1 1 1 1 1 1 1 1 1 1 1 1 1 1 1 1 1 1 1 1 1 1 1 1
symmnumber: 1
zpe: 1035530.9 jmol-1
zpe.correction: 0.394413 hartree
zpe.thermalcorrener: 0.414681 hartree
zpe.thermalcorrenthalpy: 0.415625 hartree
zpe.thermalcorrgfe: 0.343235 hartree
zpe.sumelectzpe: -738.205253 hartree
zpe.sumelectthermal: -738.184985 hartree
zpe.sumelectthermalent: -738.184041 hartree
zpe.sumelectthermalfe: -738.256430 hartree
dipole: 0.0033 0.0495 0.0352
dipole: 0.0608
quadrupole: -107.0740 -122.6010 -109.7664
quadrupole: 1.0731 -0.7023 0.8358
quadrupole: 6.0732 -9.4539 3.3807 1.0731 -0.7023 0.8358
hfenergy: -738.5996659 hartree
pointgroup: C01 [X(C19H26)]
dipole: -0.0018418 0.0231438 0.0058014 debye
polarizability: 265.2131793|-10.9725385|189.0633005|1.4597951|-26.6287693|169.6142105 unknown
InChI: InChI=1S/C19H26/c1-5-14(4)16-10-8-13-19-17(15(6-2)7-3)11-9-12-18(16)19/h8-15H,5-7H2,1-4H3
charge 0 multiplicity 1
45 atoms
C  -3.081482 -0.255518 0.29323
C  -1.730083 0.269074 -0.216673
C  -0.459119 -0.348787 0.116016
C  3.406633 0.139952 -0.568146
C  0.786234 0.220557 -0.40101
C  2.057213 -0.394081 -0.062389
C  -3.768303 0.771596 1.245658
C  -4.035231 -0.643021 -0.877503
C  4.368203 0.513244 0.600462
C  -1.731737 1.407568 -1.035238
C  -0.377282 -1.515137 0.949122
C  0.704295 1.384569 -1.237624
C  2.059271 -1.534689 0.752692
C  4.077846 -0.876186 -1.532623
C  -0.525818 1.963884 -1.546905
C  -2.958885 1.070419 2.525222
C  -3.486839 -1.772988 -1.774506
C  0.852445 -2.095313 1.257878
C  3.827711 1.639347 1.50695
H  -2.924941 -1.177508 0.884092
H  3.244212 1.07099 -1.140743
H  -3.950822 1.715301 0.693323
H  -4.76567 0.373209 1.522613
H  -5.006081 -0.954366 -0.440982
H  -4.246285 0.25252 -1.495948
H  5.33836 0.822246 0.161009
H  4.577054 -0.388382 1.210498
H  -2.684218 1.884994 -1.293402
H  -1.28913 -1.962673 1.352648
H  1.615256 1.830702 -1.645192
H  3.01186 -2.010491 1.013331
H  3.410067 -1.126475 -2.376561
H  5.016788 -0.460146 -1.944122
H  4.325804 -1.818304 -1.00964
H  -0.568267 2.852349 -2.186996
H  -1.970525 1.499121 2.280385
H  -3.491656 1.79004 3.173742
H  -2.787846 0.148416 3.112813
H  -4.204102 -2.029669 -2.575671
H  -2.535264 -1.475659 -2.250682
H  -3.294871 -2.69007 -1.185662
H  0.894207 -2.98671 1.893889
H  4.546835 1.885865 2.309541
H  3.640397 2.561951 0.925309
H  2.874765 1.343162 1.981293
