program: Gaussian 09
title: 000271118
version: EM64L-G09RevD.01
frameworkgroup: C1[X(C9H10O3)]
method: RPBEPBE
basis: SDD
operation: Freq
keyword: #pfreq=noraman
keyword: PBEPBE/SDD
title: #p freq=noraman PBEPBE/SDD
converged: YES YES NO NO
title: Mulliken charges:
elementType: O O O C C C C C C C C C H H H H H H H H H H
charge: -0.290161 -0.246474 -0.435288 -0.122634 0.317195 -0.302101 -0.329738 0.142389 -0.326037 -0.386060 -0.254435 -0.202474 0.253632 0.217911 0.222174 0.214290 0.234429 0.262108 0.218187 0.227354 0.227142 0.358590
chargesum: 0.00000
title: Mulliken charges with hydrogens summed into heavy atoms:
elementType: O O O C C C C C C C C C
charge: -0.290161 -0.246474 -0.076698 0.130999 0.317195 0.137985 0.118981 0.142389 -0.063930 -0.167874 -0.027081 0.024668
polarizability: 1.32689190e+02 -6.57994430e-01 1.11176413e+02 -4.32923259e+00 -2.41935050e+00 6.16484695e+01
1716.lowfreq: -8.7398 -0.8340 -0.0008 -0.0006 -0.0006 13.8756 28.6150 58.1043 107.0616
frequency: 27.8839 57.9413 107.0572 175.8296 214.2230 260.2822 280.6949 347.2404 354.3077 458.8339 472.4819 519.8185 552.1421 602.6050 615.6099 685.8066 722.1281 756.8335 790.6527 820.9456 830.6379 849.5173 864.7532 893.1547 937.5833 947.1553 975.1172 981.7554 1028.0967 1037.3934 1077.1717 1110.1590 1147.8533 1157.5448 1169.3503 1193.8229 1195.8492 1243.6690 1253.8599 1286.4462 1318.6399 1326.3486 1340.2374 1396.7785 1439.7558 1469.6848 1475.2701 1489.4290 1606.1708 1613.9019 2986.0578 2998.5243 3061.4314 3086.4832 3105.6786 3113.0152 3137.4467 3154.6311 3171.1290 3584.8328
redmass: 3.4597 4.5575 4.2684 4.8938 4.7367 2.4524 6.7040 1.7613 1.8459 3.9194 3.9291 5.8682 4.5053 4.8537 2.6387 7.5248 3.4764 1.4140 4.9167 3.0983 4.3149 1.8078 2.4859 5.4040 2.3974 1.4493 2.9365 1.3263 5.6265 2.0999 2.2564 1.7118 1.2363 1.1366 1.0757 1.8498 1.2647 2.6239 1.3424 1.4449 1.2691 1.2402 1.3710 5.9058 2.4174 1.0900 1.0981 2.6512 6.6403 6.8567 1.0677 1.0614 1.0879 1.1023 1.1013 1.0883 1.0883 1.0935 1.0989 1.0661
irintensity: 8.7505 3.0459 3.6724 2.3003 2.7827 4.6935 7.9837 66.8266 68.7079 6.8441 8.8553 15.2498 3.6010 15.3572 2.9205 6.0645 25.5201 90.6339 20.2588 27.2255 47.5645 4.4763 9.0261 16.5599 21.6040 0.6588 9.8563 0.6412 174.1748 5.0515 83.6015 13.9758 72.2042 1.9071 7.5399 34.7284 6.8534 33.2169 15.2895 73.1368 2.0839 3.5009 20.4389 13.0693 38.8100 5.8408 2.5097 20.3891 27.1062 22.8761 44.3773 82.6853 19.1303 25.1965 33.5087 13.6332 8.7323 17.0930 16.6671 32.3473
temp: 298.150 k
press: 1.00000 atm
elementType: 8 8 8 6 6 6 6 6 6 6 6 6 1 1 1 1 1 1 1 1 1 1
symmnumber: 1
zpe: 453861.1 jmol-1
zpe.correction: 0.172867 hartree
zpe.thermalcorrener: 0.183315 hartree
zpe.thermalcorrenthalpy: 0.184259 hartree
zpe.thermalcorrgfe: 0.135717 hartree
zpe.sumelectzpe: -573.699960 hartree
zpe.sumelectthermal: -573.689512 hartree
zpe.sumelectthermalent: -573.688568 hartree
zpe.sumelectthermalfe: -573.737110 hartree
dipole: -0.9373 -0.6471 1.2735
dipole: 1.7085
quadrupole: -52.6471 -64.3234 -75.3402
quadrupole: -8.2424 1.8149 -3.3565
quadrupole: 11.4564 -0.2198 -11.2366 -8.2424 1.8149 -3.3565
hfenergy: -573.8728268 hartree
pointgroup: C01 [X(C9H10O3)]
dipole: -0.3649002 -0.2637312 0.4991072 debye
dipolederiv: -1.0153498 0.1434743 0.0412113 0.2219688 -0.4071427 -0.0223189 -0.0329462 -0.0467858 -0.5204335 -0.8960471 0.0560562 -0.0805816 0.0670758 -0.4131345 0.0258992 -0.2106459 -0.0062396 -0.5972336 -0.1118248 -0.1709736 -0.0588314 -0.0791195 -1.3322368 0.0730733 -0.0756265 0.0771098 -0.3866901 1.3886219 -0.0317732 -0.0286658 -0.0247106 0.4676222 0.0057501 -0.0354526 0.0057675 0.6867788 -0.1651768 0.1339855 0.0044897 -0.1568928 -0.3087859 0.0307563 0.1032256 0.0145086 -0.1429287 0.6856626 -0.0383417 0.023371 0.0348275 0.2859881 -0.0359566 0.2619424 -0.0985228 0.1851995 0.3792758 -0.0358152 0.0664078 -0.1895957 0.3233462 -0.1834407 -0.0136612 -0.0488263 0.233254 0.0746963 0.1585415 -0.0115356 0.0152714 1.252346 -0.0707032 0.033163 -0.0680608 0.0739453 0.0643187 -0.0226335 -0.0604426 0.1135756 0.0819028 -0.0235449 -0.0916697 0.0175817 -0.0914606 -0.0517333 -0.3077252 -0.020842 0.0098375 -0.2425136 0.0075687 -0.0374346 0.072922 -0.1946366 -0.2612277 0.0375489 -0.0021466 0.0650377 0.0288358 -0.0059249 0.0258985 -0.001304 -0.1927746 0.1124424 0.030153 -0.0649228 -0.1233443 0.1344889 0.0085033 -0.0523072 -0.0100648 -0.1202254 -0.0331873 -0.0003763 -0.0019909 -0.0031846 -0.0465082 0.0809291 -0.0359339 0.0531167 -0.0004904 -0.1949113 -0.0570681 0.0400655 -0.1544253 0.0058141 0.0504553 0.0199382 0.0336706 0.0110094 0.0186349 0.035262 -0.0093091 0.1260209 -0.1232391 -0.0067983 -0.0106499 0.001398 0.0937884 -0.0093325 -0.0768469 0.0870243 -0.0032441 -0.1030459 0.1271807 0.0601649 0.0597158 -0.0117608 -0.0532386 -0.0322265 -0.1172933 -0.038621 0.0745549 -0.0445911 -0.1159479 -0.015571 0.0041853 0.0517511 0.0946593 0.0261666 0.1029139 0.0403573 -0.008595 0.0154444 -0.0194833 0.1318587 -0.0189776 0.0896401 0.0341824 0.1212901 -0.0511093 -0.0194132 0.0386394 -0.016589 0.1650386 0.0682567 -0.0333683 0.0193087 -0.0547642 -0.1165267 0.0064998 0.0268866 0.0033413 0.163941 -0.099279 -0.0691464 0.0532667 -0.0634115 0.0668731 0.014039 0.0540265 0.0160032 0.1455908 0.0666254 0.096974 0.0610676 0.0134944 0.3821133 -0.0093683 0.072946 -0.0236878 0.3640445 unknown
polarizability: 132.5370311|-0.8057275|111.2867859|-5.3555435|-1.0108513|61.6902556 unknown
InChI: InChI=1S/C9H10O3/c10-8-4-2-1-3-7(8)9-11-5-6-12-9/h1-4,9-10H,5-6H2
charge 0 multiplicity 1
22 atoms
O  1.980771 -0.433454 -1.163531
O  1.816882 1.012444 0.714811
O  -1.035563 2.337881 -0.176769
C  1.132609 0.607445 -0.545756
C  -0.261097 0.061311 -0.286579
C  3.165293 -0.623505 -0.289608
C  2.666418 -0.140506 1.083098
C  -1.334859 0.967195 -0.075119
C  -0.531261 -1.323927 -0.228217
C  -2.63755 0.498542 0.213645
C  -1.827429 -1.807111 0.062545
C  -2.879418 -0.891053 0.28832
H  1.112964 1.519029 -1.165396
H  4.005084 -0.003052 -0.656423
H  3.433064 -1.692314 -0.327254
H  2.072961 -0.919595 1.601762
H  3.457762 0.243396 1.744692
H  0.288865 -2.014972 -0.445506
H  -3.456614 1.211485 0.376876
H  -2.016607 -2.884749 0.102223
H  -3.889198 -1.252205 0.512289
H  -1.838176 2.889016 -0.003603
