program: Gaussian 09
title: 000271117
version: EM64L-G09RevD.01
frameworkgroup: C1[X(C17H14N2O3)]
method: RPBEPBE
basis: SDD
operation: Freq
keyword: #p
keyword: freq=noraman
keyword: PBEPBE/SDD
title: #p freq=noraman PBEPBE/SDD
converged: YES YES NO NO
title: Mulliken charges:
elementType: O O O N N C C C C C C C C C C C C C C C C C H H H H H H H H H H H H H H
charge: -0.244082 -0.198153 -0.262000 -0.184644 -0.426858 0.156322 -0.285270 0.049059 0.508048 0.131723 -0.632329 0.172462 0.354237 -0.345121 -0.391243 -0.331983 -0.230531 -0.234786 -0.402960 -0.237350 -0.252076 -0.210475 0.240266 0.247433 0.246619 0.276168 0.330418 0.246541 0.230435 0.273128 0.232293 0.229990 0.238025 0.232702 0.238030 0.235962
chargesum: 0.00000
title: Mulliken charges with hydrogens summed into heavy atoms:
elementType: O O O N N C C C C C C C C C C C C C C C C C
charge: -0.244082 -0.198153 -0.262000 -0.184644 -0.096440 0.156322 -0.045003 0.049059 0.508048 0.131723 0.137892 0.172462 0.354237 -0.098580 -0.160808 -0.058855 0.001762 -0.004796 -0.164935 -0.004649 -0.014047 0.025487
polarizability: 1.94405114e+02 -1.75246302e+01 2.31230149e+02 -3.33394591e+01 -7.74943776e+00 1.63279465e+02
1716.lowfreq: -9.9894 -5.2550 -0.0006 -0.0005 0.0007 3.8650 27.4154 31.7218 50.9345
frequency: 27.1094 31.5313 50.8996 73.7342 81.7059 89.1711 111.7456 120.0430 150.3398 177.1748 225.4481 258.3468 276.8667 287.2541 301.7642 339.0270 362.5288 371.1787 393.2404 402.6222 418.3025 440.2588 489.1071 515.8350 541.3237 569.3512 600.2278 612.1285 614.3824 642.4233 645.1616 659.1291 684.0317 699.6296 716.8850 756.5249 764.7043 772.9471 776.8304 827.2908 849.0677 855.1581 865.5800 886.0683 917.4199 930.6672 961.1012 970.8008 975.6756 990.2101 992.1827 998.2213 1026.2394 1027.0158 1055.2216 1083.3059 1088.8553 1108.7812 1126.5302 1168.1349 1174.5169 1177.8763 1187.3894 1191.7765 1216.5312 1233.9032 1267.1874 1293.2053 1304.0052 1323.2471 1347.3094 1374.1505 1375.5501 1393.6708 1406.6653 1418.3911 1445.5057 1453.6588 1474.9412 1480.5215 1486.7340 1490.0973 1567.2160 1587.1970 1592.3106 1614.0581 1615.2785 1641.6906 2991.7788 3083.5455 3085.0606 3120.7774 3125.3826 3127.8674 3133.1373 3145.3821 3146.4942 3159.1331 3161.2908 3173.6810 3175.2607 3503.9024
redmass: 4.0833 5.4609 6.1960 5.7368 1.4876 3.5390 3.3317 3.4498 3.9727 5.5664 5.4497 4.6316 6.9014 4.5250 4.5958 6.2944 7.4080 5.7109 5.9311 2.8094 7.1633 4.9435 5.0902 3.7572 3.8081 5.2600 4.8497 3.1177 3.8029 6.2254 5.3984 5.1926 4.6789 1.7741 2.7346 3.1956 2.1952 3.7994 1.5900 5.0126 1.2966 3.9905 2.3380 2.3647 1.4877 5.3530 1.4807 3.4362 1.4973 5.9660 1.3614 1.3306 2.1803 2.3542 1.8537 1.6191 1.6576 1.9804 1.3119 3.0451 1.0806 1.1684 1.2986 1.9570 2.5169 1.9422 1.7115 2.2763 4.5110 1.7148 3.9847 4.3089 3.2259 3.3684 1.9329 1.2557 2.1371 2.7420 1.0783 2.2232 2.0410 1.1950 7.8131 7.8835 5.9896 6.2119 6.1031 6.4216 1.0361 1.0961 1.0909 1.0874 1.0880 1.1017 1.0873 1.0894 1.0926 1.0937 1.0965 1.0987 1.1001 1.0757
irintensity: 0.0303 0.3906 1.8957 0.2885 1.5123 1.3009 1.3435 0.1669 2.7636 1.8461 1.8295 7.4806 3.8749 1.0473 1.3790 13.2871 1.4420 6.1253 4.6993 0.1606 5.1429 0.1873 7.1135 17.1090 1.8101 4.1918 19.8507 18.6291 16.6037 26.3608 5.7378 11.4956 44.6292 63.5174 40.0329 22.0182 22.1506 10.2042 78.1256 8.9656 0.2633 4.6511 0.7306 1.9332 0.6788 21.7975 4.6688 4.5124 0.5526 0.3102 0.8081 0.1184 11.9935 6.8224 5.4899 14.0653 1.8638 21.1432 3.6442 45.3670 0.8846 10.0529 8.8103 16.0016 19.4188 18.9387 5.3279 31.4826 47.0413 14.5583 217.6547 2.3731 9.3476 1.8845 7.6047 70.8075 10.0137 55.7351 17.7238 26.7122 7.2860 13.6709 105.8367 155.7627 0.6493 57.0049 6.8720 379.4864 36.0841 11.0109 16.4300 5.9253 5.5721 0.5596 1.3867 8.4666 19.9720 9.2345 25.8203 9.1112 15.1409 32.1693
temp: 298.150 k
press: 1.00000 atm
elementType: 8 8 8 7 7 6 6 6 6 6 6 6 6 6 6 6 6 6 6 6 6 6 1 1 1 1 1 1 1 1 1 1 1 1 1 1
symmnumber: 1
zpe: 717889.3 jmol-1
zpe.correction: 0.273430 hartree
zpe.thermalcorrener: 0.291859 hartree
zpe.thermalcorrenthalpy: 0.292803 hartree
zpe.thermalcorrgfe: 0.225875 hartree
zpe.sumelectzpe: -989.827163 hartree
zpe.sumelectthermal: -989.808734 hartree
zpe.sumelectthermalent: -989.807789 hartree
zpe.sumelectthermalfe: -989.874718 hartree
dipole: -0.7460 4.6971 -1.7120
dipole: 5.0547
quadrupole: -116.0153 -125.3100 -134.5284
quadrupole: 6.2837 -5.9634 -15.2863
quadrupole: 9.2693 -0.0254 -9.2439 6.2837 -5.9634 -15.2863
hfenergy: -990.1005923 hartree
pointgroup: C01 [X(C17H14N2O3)]
dipole: 0.3429337 1.7666052 -0.8463806 debye
polarizability: 186.1173948|-4.6722545|238.3242755|-34.1390541|-2.6593493|164.4730584 unknown
InChI: InChI=1S/C17H14N2O3/c1-19-15(20)12-9-5-6-10-13(12)18-16(21)17(19)14(22-17)11-7-3-2-4-8-11/h2-10,14,18H,1H3
charge 0 multiplicity 1
36 atoms
O  -1.261046 -2.384847 -0.76849
O  1.496879 -3.443891 -1.091387
O  0.390044 0.070035 2.904984
N  -0.089587 -1.421733 1.180983
N  2.296237 -1.305864 -0.624531
C  -0.063335 -1.718547 -0.235643
C  -0.945462 -0.968177 -1.227835
C  1.285196 -2.268196 -0.696738
C  -1.878743 0.133228 -0.863577
C  0.506382 -0.261505 1.68471
C  -0.679399 -2.422087 2.095489
C  1.310891 0.581805 0.727988
C  2.171637 0.079839 -0.29728
C  -2.771697 0.042802 0.234157
C  -1.868552 1.311625 -1.655023
C  1.314695 1.97697 0.99316
C  -3.62812 1.120972 0.541865
C  -2.721347 2.391078 -1.342256
C  3.015077 0.979606 -1.004985
C  -3.603432 2.299213 -0.240476
C  2.133227 2.865358 0.274119
C  2.998345 2.357928 -0.725676
H  -0.558339 -0.941027 -2.256871
H  -0.031198 -3.314601 2.17094
H  -1.66934 -2.734188 1.725825
H  -0.769654 -1.949309 3.085373
H  3.205704 -1.622575 -0.976811
H  -2.809945 -0.877346 0.824503
H  -1.18814 1.385155 -2.512579
H  0.674476 2.334291 1.805611
H  -4.316048 1.041908 1.390564
H  -2.703369 3.296906 -1.958014
H  3.677242 0.585646 -1.785447
H  -4.270191 3.134235 0.001233
H  2.112247 3.936637 0.496868
H  3.654663 3.032657 -1.285654
