program: Gaussian 09
title: 000271114
version: EM64L-G09RevD.01
frameworkgroup: C1[X(C13H8N4O8S)]
method: RPBEPBE
basis: SDD
operation: Freq
keyword: #p
keyword: freq=noraman
keyword: PBEPBE/SDD
title: #p freq=noraman PBEPBE/SDD
converged: YES YES NO NO
title: Mulliken charges:
elementType: S O O O O O O O O N N N N C C C C C C C C C C C C C H H H H H H H H
charge: 0.301030 -0.156448 -0.154304 -0.162975 -0.168821 -0.172243 -0.172437 -0.201744 -0.202894 0.007404 0.008104 0.023576 0.028235 -0.610057 -0.825864 0.496425 0.560532 0.554920 0.464849 -0.507572 -0.510247 -0.328852 -0.367000 0.377148 -0.345326 -0.346346 0.319283 0.308007 0.334927 0.334805 0.276429 0.256587 0.290290 0.290581
chargesum: 0.00000
title: Mulliken charges with hydrogens summed into heavy atoms:
elementType: S O O O O O O O O N N N N C C C C C C C C C C C C C
charge: 0.301030 -0.156448 -0.154304 -0.162975 -0.168821 -0.172243 -0.172437 -0.201744 -0.202894 0.007404 0.008104 0.023576 0.028235 -0.610057 -0.198575 0.496425 0.560532 0.554920 0.464849 -0.172645 -0.175442 -0.052423 -0.110413 0.377148 -0.055035 -0.055766
polarizability: 4.19956778e+02 2.63340642e+00 2.40154171e+02 2.99290335e+00 -2.56424765e+00 1.05493100e+02
1716.lowfreq: -0.0009 0.0013 0.0016 1.3067 2.1292 5.0531 12.9336 20.2018 27.3437
frequency: 12.8611 20.1667 27.1288 42.8621 46.6492 52.9589 63.4560 68.3728 85.8195 96.9963 113.3309 134.8471 140.1989 162.4379 167.0954 207.9724 217.2753 255.5806 298.6205 303.2249 303.6854 314.7853 344.4761 345.1427 373.1242 408.4098 427.9783 451.7610 473.5902 504.5056 506.0201 514.2060 558.1346 606.3795 618.4860 627.3383 642.3863 652.1287 673.0672 673.8696 698.7099 714.1065 721.6553 742.2618 746.7559 762.3376 786.4093 823.3044 855.6331 861.1391 875.6250 881.3586 901.7428 951.7515 962.0457 991.6842 1000.3923 1006.7635 1026.6860 1090.8618 1094.5562 1099.1016 1136.2368 1153.0230 1176.2703 1183.4485 1205.6499 1216.2456 1218.1380 1221.2310 1226.3273 1235.5837 1303.7117 1353.4519 1369.3673 1377.0285 1386.9486 1394.5535 1402.9718 1410.4001 1421.7461 1422.8678 1468.1549 1481.6125 1581.6594 1588.6336 1596.3217 1608.5204 3063.6669 3146.2562 3150.4100 3151.5058 3182.6209 3184.0101 3184.6407 3186.9166
redmass: 10.6684 13.5032 6.6519 13.7854 11.6917 15.4588 13.6376 6.3738 8.2882 9.3719 10.2024 9.0265 14.5416 14.6642 6.2327 13.0843 5.5867 9.3242 8.3351 11.9222 10.3975 13.6772 2.8219 9.2354 8.3036 2.8836 6.5761 12.3114 4.6177 5.9933 6.5176 8.8040 7.9845 6.2487 5.9728 6.7640 5.6958 12.2192 4.2692 11.5489 10.6359 5.2133 7.9290 14.5138 5.1016 6.5465 5.3424 5.3685 1.2585 10.9618 1.6524 11.6140 1.4912 1.4125 1.7159 1.3446 1.3692 3.0900 6.7380 3.1617 1.2887 1.4845 1.0978 12.1754 1.6090 1.3549 13.6224 9.9933 4.2679 1.4836 4.8643 3.3184 1.2896 4.5967 7.9297 10.0078 6.9919 13.9873 8.1799 7.5826 3.5872 4.2915 1.1351 2.4492 9.8547 7.3695 7.7055 6.2313 1.0562 1.0924 1.1035 1.0974 1.0928 1.0938 1.0946 1.0958
irintensity: 0.4889 0.4074 0.0958 0.2605 1.5738 0.1420 0.4165 0.0845 3.1288 5.7764 3.2610 3.6441 2.9821 3.6353 0.1104 0.1157 0.5338 1.3287 2.9935 0.6933 0.7759 0.1106 1.5451 0.4662 7.3694 0.4498 0.0615 13.4054 6.1714 9.8279 3.6231 2.9103 17.2404 52.8026 6.8006 3.9977 0.3363 19.7431 33.2308 37.5552 9.3135 13.7577 1.6076 14.4683 24.6970 26.3695 14.8289 1.5756 1.1427 15.2008 46.2246 33.6383 4.7612 1.7646 36.6391 1.9806 0.1458 7.3911 44.5239 20.7861 10.1383 16.5597 4.9864 0.1998 0.9871 54.3821 416.7909 220.2400 305.4800 1.6674 11.4461 0.0376 0.6406 18.7222 90.8379 35.4005 153.5208 23.9525 0.1683 93.2752 45.6254 139.6671 5.0684 2.0308 4.5183 47.4294 1.2392 23.3852 8.2546 4.1583 0.5287 0.5088 25.0292 20.2189 0.3611 3.3426
temp: 298.150 k
press: 1.00000 atm
elementType: 16 8 8 8 8 8 8 8 8 7 7 7 7 6 6 6 6 6 6 6 6 6 6 6 6 6 1 1 1 1 1 1 1 1
symmnumber: 1
zpe: 553406.5 jmol-1
zpe.correction: 0.210781 hartree
zpe.thermalcorrener: 0.234044 hartree
zpe.thermalcorrenthalpy: 0.234988 hartree
zpe.thermalcorrgfe: 0.153275 hartree
zpe.sumelectzpe: -1716.831988 hartree
zpe.sumelectthermal: -1716.808725 hartree
zpe.sumelectthermalent: -1716.807781 hartree
zpe.sumelectthermalfe: -1716.889494 hartree
dipole: -3.3713 0.6622 -2.0607
dipole: 4.0063
quadrupole: -222.9711 -169.7107 -154.1006
quadrupole: 4.7434 -3.8464 -0.5028
quadrupole: -40.7103 12.5501 28.1602 4.7434 -3.8464 -0.5028
hfenergy: -1717.0427692 hartree
pointgroup: C01 [X(C13H8N4O8S1)]
dipole: 1.314276 0.2718086 0.8265703 debye
polarizability: 419.9258514|1.9113052|239.8814316|4.8477752|6.4562092|105.796766 unknown
InChI: InChI=1S/C13H8N4O8S/c18-14(19)9-3-1-8(2-4-9)7-26-13-11(16(22)23)5-10(15(20)21)6-12(13)17(24)25/h1-6H,7H2
charge 0 multiplicity 1
34 atoms
S  -0.116627 0.377475 -0.889358
O  2.680834 3.544174 -0.818337
O  1.927583 -3.323635 -1.035526
O  0.901542 2.929381 0.475476
O  0.30403 -2.410826 0.286754
O  6.578587 0.74587 0.496674
O  6.329307 -1.524884 0.424513
O  -7.118957 -1.623556 -0.334789
O  -7.462025 0.62998 -0.2437
N  1.980078 2.677229 -0.176886
N  1.425664 -2.364692 -0.342001
N  5.872982 -0.322732 0.367527
N  -6.701218 -0.411344 -0.187123
C  1.615966 0.168006 -0.326423
C  -1.051629 0.409104 0.817997
C  -2.516083 0.1962 0.550981
C  2.492713 1.275217 -0.152295
C  2.229651 -1.113473 -0.226251
C  4.409641 -0.15446 0.133983
C  3.876361 1.142874 0.060398
C  3.607702 -1.297885 -0.01526
C  -3.028598 -1.118331 0.371969
C  -3.398611 1.306029 0.471544
C  -5.251255 -0.200781 0.064598
C  -4.399012 -1.325557 0.130628
C  -4.773104 1.116635 0.23025
H  -0.820805 1.389296 1.2568
H  -0.606348 -0.41349 1.394848
H  4.522675 2.019276 0.1607
H  4.047711 -2.298224 0.025703
H  -2.345643 -1.973307 0.420064
H  -3.005062 2.320052 0.602231
H  -4.817421 -2.326037 -0.005948
H  -5.471726 1.954915 0.169458
