program: Gaussian 09
title: 000271112
version: EM64L-G09RevD.01
frameworkgroup: C1[X(C14H12ClNO2S)]
method: RPBEPBE
basis: SDD
operation: Freq
keyword: #p
keyword: freq=noraman
keyword: PBEPBE/SDD
title: #p freq=noraman PBEPBE/SDD
converged: YES YES NO NO
title: Mulliken charges:
elementType: Cl S O O N C C C C C C C C C C C C C C H H H H H H H H H H H H
charge: -0.052761 0.187025 -0.208396 -0.208418 0.026941 0.497816 -0.810730 -0.807292 0.497930 -0.352804 -0.334989 0.371719 -0.357875 -0.365957 -0.347841 -0.348706 -0.206470 -0.205204 -0.101303 0.266428 0.263453 0.263454 0.263273 0.247895 0.249606 0.242391 0.241533 0.286973 0.286791 0.257751 0.257768
chargesum: 0.00000
title: Mulliken charges with hydrogens summed into heavy atoms:
elementType: Cl S O O N C C C C C C C C C C C C C C
charge: -0.052761 0.187025 -0.208396 -0.208418 0.026941 0.497816 -0.280849 -0.280565 0.497930 -0.104910 -0.085383 0.371719 -0.115484 -0.124424 -0.060868 -0.061915 0.051281 0.052564 -0.101303
polarizability: 3.44808110e+02 -2.39527641e+00 1.43255136e+02 -1.55290133e+00 -2.36321985e+01 1.57955876e+02
1716.lowfreq: -4.3074 -0.9269 -0.0016 0.0009 0.0012 5.7072 13.6017 19.5179 20.9539
frequency: 7.7563 19.4933 20.3921 31.1835 54.9481 57.2232 68.4275 113.7926 124.1984 175.2154 209.1339 234.0389 290.0983 317.7325 336.2600 352.4097 373.3662 387.5413 407.0465 407.1975 483.7529 497.3848 506.4877 607.7051 626.8488 627.9151 629.9681 641.8344 655.4824 676.2747 725.6785 748.6940 764.3432 802.1261 821.6955 828.0412 840.8187 847.7152 870.6897 880.8061 913.4516 951.4150 964.7963 985.6356 992.4993 1000.6045 1005.9575 1072.5931 1085.6933 1092.7492 1093.6407 1130.5763 1137.3201 1180.0370 1183.9719 1210.9733 1220.8100 1222.4049 1224.8032 1263.6908 1295.8200 1299.5257 1365.8386 1379.8648 1396.4876 1404.9879 1419.7343 1456.7823 1463.8928 1478.3167 1481.7686 1586.7412 1596.6841 1600.9006 1608.5876 3012.2222 3016.0291 3082.8949 3088.7255 3136.0904 3138.4335 3144.3683 3147.1360 3171.1120 3174.3262 3183.7281 3186.1536
redmass: 6.2558 11.4868 4.2627 4.8697 7.5290 9.5510 6.8175 8.7262 8.9714 9.1135 5.0764 4.5413 6.8721 7.8024 2.8564 2.7059 7.6150 8.9808 2.8691 2.8714 3.7324 3.5716 7.0063 5.6612 6.8451 6.7963 6.3339 6.4582 5.5980 3.9493 3.3490 4.9776 6.1949 4.2937 4.5533 1.2476 1.7877 1.2477 1.7655 1.4645 1.5092 1.3578 1.3755 1.3407 1.3751 4.2049 3.0601 2.7637 1.2548 3.2317 1.2937 1.1073 1.0855 1.3259 1.1200 1.1614 4.2758 3.1352 3.4062 1.2974 1.2697 1.2811 7.9101 7.2981 2.8560 8.6771 3.5026 1.1110 1.1161 2.5121 2.5379 7.3746 7.7220 6.3166 6.3857 1.0564 1.0569 1.1089 1.1088 1.0900 1.0900 1.0907 1.0909 1.0954 1.0964 1.0945 1.0956
irintensity: 0.0267 0.8146 0.0352 0.1854 2.2598 0.7635 0.3723 0.9583 0.5112 1.8804 0.9970 0.0220 1.0712 1.2417 0.6653 0.6827 8.9365 8.1512 0.0030 0.0085 17.8129 7.5214 0.8665 20.7032 0.1123 1.7071 8.1909 5.5234 14.2579 41.0269 18.1182 3.2832 33.5867 16.9184 9.5269 0.0429 38.0298 0.1682 48.3232 2.9802 1.0069 0.0245 0.0189 3.0571 0.0196 46.3726 4.6589 50.3032 0.6551 20.1932 17.5754 0.1187 11.1207 66.8470 3.6159 36.8026 285.7400 15.9165 54.1551 5.4170 0.1850 0.0094 97.5024 0.5483 4.9027 0.2439 47.6828 3.7769 5.4696 84.5558 7.1135 1.0836 1.6754 26.6604 69.7857 53.3477 2.6284 18.8993 0.0278 7.6406 9.0831 9.1094 6.0115 5.9664 0.6522 0.0631 4.3517
temp: 298.150 k
press: 1.00000 atm
elementType: 17 16 8 8 7 6 6 6 6 6 6 6 6 6 6 6 6 6 6 1 1 1 1 1 1 1 1 1 1 1 1
symmnumber: 1
zpe: 594080.4 jmol-1
zpe.correction: 0.226273 hartree
zpe.thermalcorrener: 0.244100 hartree
zpe.thermalcorrenthalpy: 0.245044 hartree
zpe.thermalcorrgfe: 0.174182 hartree
zpe.sumelectzpe: -1602.575306 hartree
zpe.sumelectthermal: -1602.557480 hartree
zpe.sumelectthermalent: -1602.556536 hartree
zpe.sumelectthermalfe: -1602.627398 hartree
dipole: -3.5987 4.5235 2.2305
dipole: 6.1958
quadrupole: -183.8472 -122.1825 -116.5678
quadrupole: 9.2523 3.7879 -5.7995
quadrupole: -42.9813 18.6833 24.2980 9.2523 3.7879 -5.7995
hfenergy: -1602.8015798 hartree
pointgroup: C01 [X(C14H12Cl1N1O2S1)]
dipole: -1.480945 -0.0700425 -1.9349074 debye
polarizability: 344.7564379|-0.037635|174.3759706|-4.3978631|6.8949548|126.8867138 unknown
InChI: InChI=1S/C14H12ClNO2S/c15-13-5-1-11(2-6-13)9-19-10-12-3-7-14(8-4-12)16(17)18/h1-8H,9-10H2
charge 0 multiplicity 1
31 atoms
Cl -7.441437 0.086457 1.814406
S  -0.734486 -0.126471 -0.296398
O  6.447097 -1.003962 1.166284
O  6.297508 1.270897 1.247958
N  5.829037 0.107347 0.93905
C  1.986322 -0.074737 -0.974269
C  0.634138 -0.137269 -1.638744
C  -2.244231 -0.012647 -1.476261
C  -3.518113 0.01093 -0.668611
C  2.709394 -1.264821 -0.694426
C  2.548855 1.176251 -0.602229
C  4.500448 0.043706 0.282581
C  -4.051753 1.237782 -0.19555
C  -4.20106 -1.193205 -0.357691
C  3.968949 -1.216647 -0.067053
C  3.806277 1.246641 0.025047
C  -5.243209 1.271163 0.561419
C  -5.393964 -1.180802 0.398037
C  -5.89727 0.056332 0.844666
H  0.512702 -1.059439 -2.231162
H  0.457772 0.740918 -2.283315
H  -2.118561 0.909112 -2.069565
H  -2.20072 -0.888847 -2.144895
H  2.278819 -2.233876 -0.969328
H  1.991841 2.097492 -0.804509
H  -3.532278 2.176948 -0.417592
H  -3.79894 -2.151328 -0.706324
H  4.541002 -2.121473 0.153649
H  4.256216 2.199362 0.31569
H  -5.653606 2.218844 0.921409
H  -5.919451 -2.110656 0.633126
