program: Gaussian 09
title: 000271106
version: EM64L-G09RevD.01
frameworkgroup: C1[X(C9H9FO3)]
method: RPBEPBE
basis: SDD
operation: Freq
keyword: #pfreq=noraman
keyword: PBEPBE/SDD
title: #p freq=noraman PBEPBE/SDD
converged: YES YES NO NO
title: Mulliken charges:
elementType: F O O O C C C C C C C C C H H H H H H H H H
charge: -0.203007 -0.442154 -0.390756 -0.254121 -0.353043 0.542293 -0.360054 -0.415185 -0.350753 0.162769 -0.357217 -0.367046 0.314586 0.272190 0.210323 0.236303 0.243097 0.246666 0.258922 0.258015 0.365100 0.383072
chargesum: 0.00000
title: Mulliken charges with hydrogens summed into heavy atoms:
elementType: F O O O C C C C C C C C C
charge: -0.203007 -0.077054 -0.007683 -0.254121 -0.080853 0.542293 0.086572 -0.172088 -0.104087 0.162769 -0.098295 -0.109031 0.314586
polarizability: 1.39361270e+02 -8.62623313e-03 7.51294718e+01 -5.16290381e+00 -8.78764659e+00 9.50732431e+01
1716.lowfreq: -4.9836 -0.0002 0.0002 0.0008 4.2975 11.7317 34.4672 38.7370 67.5129
frequency: 34.4533 38.6727 67.5082 107.8263 151.0842 180.2877 219.0140 293.3903 314.3283 362.6572 393.9200 412.9701 464.2834 490.3108 532.3285 540.5320 563.6750 611.1223 631.8899 674.2897 725.1100 781.5189 798.8327 820.2122 834.4793 863.9254 943.3376 960.5609 981.3274 1001.3718 1007.8247 1030.5860 1090.3149 1105.3324 1156.9542 1173.9222 1197.8557 1206.9285 1235.9196 1268.4119 1300.0659 1331.0442 1346.8287 1376.9590 1387.3574 1411.1283 1461.7350 1494.6359 1601.7474 1612.0909 1632.0830 2979.1569 3025.0171 3090.5184 3130.5320 3139.6798 3174.6706 3177.5645 3510.1795 3522.9563
redmass: 6.1517 6.0460 7.3961 4.9858 5.2552 7.2686 3.0788 7.8476 7.3430 6.3542 5.4777 2.9440 3.9763 3.6339 1.9235 1.3398 4.2857 1.7726 5.2137 2.8409 3.9116 5.6975 2.9255 1.2460 1.6300 3.8813 1.3772 1.3579 2.7725 2.7553 2.7071 3.7080 2.1298 1.3305 1.4939 1.3297 1.4450 2.4120 2.0769 1.5269 1.3105 1.7990 1.3226 1.3833 3.9150 2.7777 1.0841 2.6431 7.6506 6.4900 8.0960 1.0668 1.0821 1.0985 1.0904 1.0903 1.0951 1.0961 1.0641 1.0653
irintensity: 0.7600 0.4653 1.0566 4.5428 2.7965 0.8844 2.1683 1.1811 3.4938 0.3264 1.5957 0.0814 3.3422 19.7437 21.9943 246.0267 43.2929 82.8453 6.9536 55.1767 4.6307 19.0521 10.0710 0.0271 62.0234 9.0162 1.1931 0.0198 119.4722 30.0681 1.8547 85.8732 183.2721 12.5251 44.0142 6.6906 1.2048 70.3458 16.2642 9.8286 6.7956 60.1673 13.2123 24.8944 10.4645 4.4996 7.3113 111.9055 3.8863 10.1401 229.3401 38.9766 10.8486 15.0455 7.9151 8.4498 2.8304 2.0682 35.9554 19.4347
temp: 298.150 k
press: 1.00000 atm
elementType: 9 8 8 8 6 6 6 6 6 6 6 6 6 1 1 1 1 1 1 1 1 1
symmnumber: 1
zpe: 430507.4 jmol-1
zpe.correction: 0.163972 hartree
zpe.thermalcorrener: 0.176013 hartree
zpe.thermalcorrenthalpy: 0.176957 hartree
zpe.thermalcorrgfe: 0.124263 hartree
zpe.sumelectzpe: -672.910629 hartree
zpe.sumelectthermal: -672.898588 hartree
zpe.sumelectthermalent: -672.897644 hartree
zpe.sumelectthermalfe: -672.950338 hartree
dipole: -0.1400 1.6342 0.5972
dipole: 1.7455
quadrupole: -91.3224 -74.1315 -69.7461
quadrupole: 9.1859 0.0563 -1.2400
quadrupole: -12.9224 4.2685 8.6539 9.1859 0.0563 -1.2400
hfenergy: -673.0746011 hartree
pointgroup: C01 [X(C9H9F1O3)]
dipole: -0.0623902 0.6837383 -0.0144197 debye
dipolederiv: -1.135946 -0.1789905 -0.1831469 -0.1825159 -0.1851963 -0.0338385 -0.2078159 -0.0370274 -0.2487353 -0.9132421 -0.2633759 -0.122417 -0.2506496 -0.6205432 0.1449577 -0.1061159 0.1157418 -0.3284957 -0.3607709 -0.0230145 -0.0771364 0.0440413 -1.1858126 0.2688996 -0.0633622 0.2174145 -0.3580319 -0.7493547 -0.2175414 0.2780198 0.0793926 -0.6924189 0.0283659 0.4161634 0.2222937 -0.5475186 -0.2403299 0.0237919 0.1042215 -0.1755277 -0.1541093 -0.0384253 0.2171705 -0.0349989 0.0426702 0.3685229 0.075532 0.047486 0.0373004 -0.1169431 -0.023081 0.1029597 0.0100692 -0.1064454 0.6315656 0.1610114 0.0839449 0.3239698 0.4793358 0.0159448 0.0355777 -0.0483593 0.2754714 -0.0248264 0.0184408 -0.0260134 0.0415008 -0.1229148 -0.0112102 0.0100493 0.0044985 0.1168506 -0.0166211 0.0253185 0.0167623 0.037296 -0.1232323 0.0156075 -0.0704091 -0.0163442 0.056883 0.863847 0.0472167 -0.4379198 -0.2558317 1.4488512 -0.2351981 -0.6446347 -0.3433294 0.5787186 -0.1704512 0.000526 -0.0405854 -0.0024504 -0.1358262 -0.0070988 -0.2132261 -0.0400124 -0.0720293 -0.2374897 -0.017019 -0.0357079 -0.0134472 -0.1485949 -0.0116439 0.1411162 0.030091 0.013617 1.2225489 0.205011 0.2022389 0.2117076 0.1244717 0.03861 0.221887 0.0330226 0.2869993 0.0733033 0.0233905 0.0169729 0.0258718 0.0520931 0.036486 -0.0400443 0.0343674 -0.0481726 -0.0134423 -0.0217789 -0.064914 -0.0308704 0.0461984 -0.009166 -0.1161403 0.0551212 -0.141266 -0.0079507 0.0584526 0.0462522 0.076585 0.0011393 -0.0415455 0.068871 -0.0720822 0.0352895 0.0680403 -0.0137179 -0.0792112 -0.0114996 0.1390933 -0.0100094 -0.0569624 -0.0080413 -0.0552471 0.0054791 -0.0242802 0.0908006 -0.0328605 0.1311464 0.0158121 0.0922257 0.0146074 0.0221638 0.0183717 -0.0290382 0.0659204 -0.0340936 0.1750883 0.01259 0.0720699 0.0151037 0.0337828 0.0705025 -0.0191331 -0.0432027 -0.0183297 0.1750304 -0.0067843 -0.057014 -0.0096929 -0.0209611 0.3222061 0.0997968 0.0385375 0.1226686 0.3945111 -0.1255282 0.0449705 -0.0871556 0.1976482 0.2260373 0.0694013 0.1190976 0.0077424 0.3186326 -0.0237445 0.1526639 -0.0552876 0.2668085 unknown
polarizability: 137.2392734|12.9999762|74.3907006|-2.6706455|0.6127735|97.934011 unknown
InChI: InChI=1S/C9H9FO3/c10-7-3-1-6(2-4-7)8(5-11)9(12)13/h1-4,8,11-12H,5H2
charge 0 multiplicity 1
22 atoms
F  4.093853 0.64451 0.621502
O  -3.135543 -2.237463 -0.593069
O  -2.222698 1.843721 -0.325275
O  -3.256209 0.193908 0.92905
C  -1.411252 -0.41966 -0.614589
C  0.045538 -0.093919 -0.285552
C  -1.759558 -1.893235 -0.251801
C  0.993804 0.085513 -1.322386
C  0.480849 -0.025399 1.064162
C  -2.384926 0.525229 0.086374
C  2.353472 0.332483 -1.030885
C  1.83331 0.225489 1.378158
C  2.740196 0.396132 0.317993
H  -1.575283 -0.283891 -1.700386
H  -1.552939 -2.070462 0.823701
H  -1.125306 -2.567568 -0.849545
H  0.66974 0.038612 -2.36807
H  -0.239312 -0.156365 1.880619
H  3.09536 0.474772 -1.821705
H  2.183492 0.285917 2.412608
H  -3.727952 -1.755993 0.042926
H  -2.875935 2.42837 0.147668
