program: Gaussian 09
title: 000271094
version: EM64L-G09RevD.01
frameworkgroup: C1[X(C17H20N2O3)]
method: RPBEPBE
basis: SDD
operation: Freq
keyword: #p
keyword: freq=noraman
keyword: PBEPBE/SDD
title: #p freq=noraman PBEPBE/SDD
converged: YES YES NO NO
title: Mulliken charges:
elementType: O O O N N C C C C C C C C C C C C C C C C C H H H H H H H H H H H H H H H H H H H H
charge: -0.278497 -0.289034 -0.260189 -0.413551 -0.083382 -0.563144 0.422774 0.230831 -0.443238 0.175254 0.180939 -0.598081 -0.500019 -0.554523 0.188952 0.195654 -0.499658 -0.329720 0.292242 -0.760977 -0.505035 -0.546478 0.230716 0.228372 0.226084 0.229325 0.359281 0.260051 0.274305 0.236316 0.229913 0.238986 0.264290 0.236686 0.252886 0.255563 0.255203 0.216641 0.225637 0.236670 0.224984 0.256970
chargesum: 0.00000
title: Mulliken charges with hydrogens summed into heavy atoms:
elementType: O O O N N C C C C C C C C C C C C C C C C C
charge: -0.278497 -0.289034 -0.260189 -0.054270 -0.083382 -0.104056 0.422774 0.230831 0.012171 0.175254 0.180939 -0.338030 -0.225714 -0.088294 0.188952 0.195654 0.003618 -0.329720 0.292242 -0.015842 0.192447 0.172146
polarizability: 2.88553089e+02 6.86586389e+00 2.46393013e+02 -1.29310364e+01 4.19336667e+00 1.35004193e+02
1716.lowfreq: -10.2455 -4.0071 -1.0963 0.0003 0.0004 0.0008 25.8911 33.3098 43.2529
frequency: 25.8817 33.3027 43.2524 49.8384 64.3325 76.5378 91.5333 101.1435 113.2721 132.8486 140.3399 143.9414 160.1633 193.6620 205.6498 215.4249 223.3964 254.8933 268.4152 283.8168 323.4228 327.2775 349.8752 364.3529 382.5324 416.9921 446.8872 455.1640 465.1242 469.2068 494.5889 526.7792 536.8412 567.4045 590.7465 605.7165 638.2336 655.1385 701.0560 714.2300 740.6298 746.1625 753.8110 781.5890 809.9119 859.9178 867.8423 887.1277 914.1981 919.9425 944.1092 961.8078 964.7932 982.5387 1016.7090 1034.4676 1060.8977 1064.1950 1108.7613 1110.5786 1118.6893 1143.6513 1155.6171 1159.5343 1172.8667 1183.5842 1189.0618 1199.8911 1224.1553 1237.6903 1260.7784 1276.9646 1281.3824 1313.0272 1321.3988 1334.6573 1352.6386 1374.5423 1378.9206 1390.9798 1421.4843 1424.2701 1437.0718 1442.1699 1449.9117 1451.9637 1453.4474 1454.4226 1460.4353 1468.8490 1470.7613 1477.6226 1479.5264 1494.0531 1507.1234 1559.3752 1599.7008 1620.0204 1624.3875 2106.5676 2951.5083 2965.6405 2967.5582 2976.4049 2983.9173 2987.6263 2993.1586 3017.3370 3049.5063 3054.6413 3060.4485 3067.1452 3071.1162 3097.6254 3123.4840 3126.0707 3131.4378 3148.8622 3195.5760 3332.9527
redmass: 3.9898 3.4973 3.2499 5.1732 3.4135 3.6929 2.5234 1.3768 2.5643 3.6539 2.7847 5.3118 2.7660 3.9603 4.0164 2.7626 2.2452 3.2990 2.7609 1.7701 2.7831 3.1514 3.4463 4.8698 3.9123 4.2702 2.8425 3.3782 3.3075 4.0940 5.4089 4.4265 4.5766 4.9912 3.2210 4.9911 4.6810 4.6332 5.5912 4.5530 3.3233 1.8362 3.0625 1.7942 2.7429 1.8195 1.8058 1.4520 3.4735 2.0905 2.2891 2.3589 2.4988 4.5130 1.7901 3.6717 2.0051 2.8418 1.2904 1.2643 2.7507 1.5814 1.4555 1.5339 1.9582 1.9817 1.9091 1.5620 1.4793 1.4835 2.3139 1.4400 3.2306 1.7454 1.4637 1.6671 1.7098 1.2535 4.5729 2.3190 1.2649 1.7078 1.2480 1.0742 1.1340 1.4679 1.1302 1.0653 1.2419 1.0476 1.0528 1.1118 1.2014 1.6834 2.3810 6.8107 2.8421 5.7318 6.7287 12.5720 1.0654 1.0691 1.0326 1.0622 1.0388 1.0327 1.0621 1.0926 1.0974 1.0996 1.1045 1.0967 1.0939 1.0992 1.1012 1.1008 1.1055 1.0915 1.0896 1.0818
irintensity: 0.7937 2.2342 2.5036 10.5067 0.7554 4.5585 8.5625 0.2352 2.9260 12.4627 0.4940 3.8333 1.4238 1.8970 1.7521 2.9393 0.9204 6.8802 4.4906 1.6548 1.3457 3.9640 1.8546 14.4880 3.3256 4.9381 4.6207 2.2327 1.8130 5.0135 3.9261 4.9323 2.5725 19.9870 1.9861 1.3081 8.7025 7.9399 2.6145 6.1744 1.8292 84.5584 4.2881 52.3991 11.7758 3.9571 10.2649 37.7945 10.6502 10.8157 5.1974 11.7493 2.3171 52.9758 22.5154 9.7631 7.8895 3.8427 2.8073 2.9720 104.5938 3.0929 4.5224 10.9798 26.8125 53.5526 38.0139 22.3011 11.5165 17.8147 10.0409 17.0140 229.5525 27.4316 5.4646 106.2627 36.1605 70.1085 6.4606 92.3332 36.9974 101.8960 2.5980 22.5355 15.0663 16.1945 14.6469 19.3099 11.0894 17.8292 33.9919 73.6965 15.3008 23.0293 63.3861 83.1864 298.0510 57.4623 41.6245 164.8748 40.9049 69.9240 37.9926 33.6898 2.5468 89.5038 35.0210 9.1466 42.1355 7.8167 30.2129 39.3009 13.8890 42.7594 9.8396 26.8714 18.8666 7.4708 2.4185 494.8401
temp: 298.150 k
press: 1.00000 atm
elementType: 8 8 8 7 7 6 6 6 6 6 6 6 6 6 6 6 6 6 6 6 6 6 1 1 1 1 1 1 1 1 1 1 1 1 1 1 1 1 1 1 1 1
symmnumber: 1
zpe: 886184.1 jmol-1
zpe.correction: 0.337530 hartree
zpe.thermalcorrener: 0.359972 hartree
zpe.thermalcorrenthalpy: 0.360916 hartree
zpe.thermalcorrgfe: 0.284835 hartree
zpe.sumelectzpe: -993.319716 hartree
zpe.sumelectthermal: -993.297274 hartree
zpe.sumelectthermalent: -993.296330 hartree
zpe.sumelectthermalfe: -993.372411 hartree
dipole: 2.8316 -1.2463 0.3324
dipole: 3.1116
quadrupole: -104.4449 -132.7300 -126.7113
quadrupole: -3.0475 0.2729 -3.8843
quadrupole: 16.8505 -11.4346 -5.4159 -3.0475 0.2729 -3.8843
hfenergy: -993.6572461 hartree
pointgroup: C01 [X(C17H20N2O3)]
dipole: -1.0983208 0.5192332 0.1507331 debye
polarizability: 289.6192609|6.2414746|245.2839847|5.6494694|-10.9408966|135.0470497 unknown
InChI: InChI=1S/C17H20N2O3/c1-11(20)4-5-13(10-18)17-14-9-16(22-3)15(21-2)8-12(14)6-7-19-17/h8-9,19H,4-7H2,1-3H3
charge 0 multiplicity 1
42 atoms
O  4.737915 1.238956 0.353202
O  3.774334 -1.442949 -0.218897
O  -4.123076 1.408469 0.362018
N  -1.578719 1.557044 -0.869892
N  -0.618665 -2.97771 0.74864
C  0.196071 3.087934 -0.097334
C  1.125763 1.884657 -0.085459
C  0.590473 0.583601 -0.331016
C  -0.909285 2.8394 -1.142619
C  -0.877455 0.415007 -0.522116
C  -1.575487 -0.800631 -0.363616
C  2.506875 2.027356 0.147586
C  1.483992 -0.516509 -0.392659
C  -3.028605 -0.995262 -0.814276
C  3.391108 0.925075 0.144649
C  2.864102 -0.372661 -0.154637
C  -4.073147 -1.036878 0.329209
C  -1.003858 -1.954325 0.24043
C  -4.452755 0.318982 0.915955
C  -5.263453 0.31539 2.201097
C  5.624595 0.283684 1.049463
C  3.217494 -2.783288 -0.455839
H  -0.270654 3.233747 0.897933
H  0.756114 4.009317 -0.33931
H  -1.675352 3.632979 -1.113626
H  -0.462167 2.834868 -2.157906
H  -2.592629 1.572813 -0.676416
H  2.940659 3.012897 0.34698
H  1.09284 -1.500607 -0.651659
H  -3.307536 -0.211596 -1.542178
H  -3.0940 -1.960979 -1.351091
H  -5.021317 -1.492452 -0.034366
H  -3.728533 -1.701895 1.145929
H  -5.998523 -0.508501 2.215671
H  -4.576352 0.150016 3.054441
H  -5.768509 1.283208 2.344556
H  5.839359 -0.591459 0.418156
H  5.169133 -0.050085 2.000223
H  6.540373 0.860595 1.251651
H  4.077486 -3.464856 -0.379457
H  2.773866 -2.855396 -1.467366
H  2.454628 -3.044652 0.301645
