program: Gaussian 09
title: 000271093
version: EM64L-G09RevD.01
frameworkgroup: C1[X(C9H12N2O)]
method: RPBEPBE
basis: SDD
operation: Freq
keyword: #p
keyword: freq=noraman
keyword: PBEPBE/SDD
title: #p freq=noraman PBEPBE/SDD
converged: YES YES NO NO
title: Mulliken charges:
elementType: O N N C C C C C C C C C H H H H H H H H H H H H
charge: -0.401223 -0.340483 -0.100821 0.218898 0.294584 -0.325459 -0.411406 0.064532 -0.809462 -0.254035 -0.226948 -0.720949 0.260340 0.230626 0.220847 0.212540 0.271595 0.228766 0.226415 0.316308 0.252436 0.223542 0.198442 0.370914
chargesum: 0.00000
title: Mulliken charges with hydrogens summed into heavy atoms:
elementType: O N N C C C C C C C C C
charge: -0.030309 -0.024175 -0.100821 0.218898 0.294584 -0.065119 -0.180779 0.064532 -0.104480 -0.025269 -0.000533 -0.046529
polarizability: 1.49545105e+02 -1.02609672e+01 1.20328765e+02 3.27910329e+00 5.38791384e+00 7.58152378e+01
1716.lowfreq: -12.0976 -0.0009 -0.0006 -0.0002 1.3398 3.6634 45.7306 84.6036 92.2210
frequency: 45.6101 84.5624 92.1919 108.6860 128.7181 183.3992 193.6437 210.9929 274.1287 285.4714 289.6538 333.2997 383.0822 414.3354 464.9681 533.4995 537.9094 597.7017 615.8262 678.5552 705.0621 737.3537 772.4387 807.4097 875.2565 943.5279 950.9180 971.2735 988.6364 989.1590 1045.9519 1048.1769 1053.9606 1070.8159 1123.1783 1142.4989 1175.7772 1215.5398 1283.9647 1294.3883 1307.4149 1367.5562 1395.1582 1398.6759 1422.4338 1427.0363 1455.4372 1466.1268 1474.4863 1486.2651 1490.0561 1582.2290 1600.1933 1618.2047 2890.5286 2972.1877 2985.1393 3069.2717 3079.0478 3090.3051 3119.3675 3134.2155 3152.0036 3170.1273 3495.6833 3522.5895
redmass: 3.7982 2.1642 3.0972 1.2123 2.2943 2.0737 3.0920 2.0865 2.7685 2.5527 1.9415 4.9218 3.2264 2.7299 2.5581 2.8327 3.7221 2.9125 4.7377 6.5493 4.0526 1.9524 1.7963 4.3345 1.3109 4.5317 1.6609 3.3895 1.5590 1.3525 1.9340 1.8154 1.4004 3.1347 1.4544 1.7652 1.0703 2.5941 1.4662 1.5241 2.4818 8.5089 1.2303 1.2278 1.1077 1.9240 1.0685 1.0717 1.2067 1.7857 1.2068 6.6727 6.0401 6.4983 1.0453 1.0914 1.0368 1.0965 1.0932 1.1001 1.0861 1.0899 1.0955 1.0983 1.0767 1.0685
irintensity: 0.8753 0.7197 2.6590 1.5857 2.3378 1.5126 4.7709 5.1733 41.9407 19.2085 71.8977 2.8125 5.0495 35.0718 9.3800 63.5397 21.9041 77.7387 22.5239 11.9498 24.3964 42.3901 33.7783 4.7178 0.0597 16.0802 8.2076 23.5014 0.8699 0.0976 10.1944 9.2071 1.1358 11.2170 13.0395 6.7023 0.9585 2.3252 0.4686 101.7984 20.0454 2.4835 26.5555 23.9516 4.5017 2.7527 18.5530 2.5173 25.9353 21.2691 11.7879 3.6635 75.5975 63.1517 95.0738 48.9082 29.0675 20.0565 34.6999 17.1510 5.1061 17.2030 32.0674 14.1730 6.7510 20.7910
temp: 298.150 k
press: 1.00000 atm
elementType: 8 7 7 6 6 6 6 6 6 6 6 6 1 1 1 1 1 1 1 1 1 1 1 1
symmnumber: 1
zpe: 507355.8 jmol-1
zpe.correction: 0.193242 hartree
zpe.thermalcorrener: 0.205890 hartree
zpe.thermalcorrenthalpy: 0.206834 hartree
zpe.thermalcorrgfe: 0.154362 hartree
zpe.sumelectzpe: -533.915165 hartree
zpe.sumelectthermal: -533.902517 hartree
zpe.sumelectthermalent: -533.901573 hartree
zpe.sumelectthermalfe: -533.954045 hartree
dipole: -0.9574 -0.8095 1.8509
dipole: 2.2356
quadrupole: -58.7514 -71.2422 -71.9442
quadrupole: 0.8228 -0.2881 1.8407
quadrupole: 8.5612 -3.9296 -4.6316 0.8228 -0.2881 1.8407
hfenergy: -534.1084069 hartree
pointgroup: C01 [X(C9H12N2O1)]
dipole: 0.3948493 -0.1901241 -0.7625892 debye
dipolederiv: -0.4844055 -0.0315232 0.0007657 0.0118872 -0.4880691 -0.4915785 0.1389689 -0.297076 -0.2595473 -0.1441506 0.340474 0.420788 0.0007953 -0.0136496 0.2257505 0.0774015 -0.1392803 -0.5405843 -0.6398767 -0.0895791 -0.1669363 -0.1652063 -0.583535 -0.2690089 -0.3501869 -0.2637528 -0.6502858 -0.0801535 0.0063798 0.0194005 -0.0495794 -0.1277551 -0.0266911 0.1078165 -0.0165468 -0.0876279 0.0661488 0.2083505 -0.0643149 0.0644867 0.2758894 -0.0730299 -0.0405905 -0.0418057 0.000213 0.0035929 -0.0975484 -0.0053268 0.0336999 0.0256943 -0.0309037 -0.0156093 -0.0138595 -0.1100067 -0.1016813 -0.2162026 0.0564866 -0.0926135 -0.0418907 -0.0239064 0.032563 -0.0229295 -0.1714351 0.8771461 -0.2297792 -0.1679615 0.0319689 0.5153531 0.5599567 0.0698345 0.5483247 0.7230924 -0.0177233 -0.1746564 0.0371718 -0.1185167 -0.1011185 0.0009658 -0.008184 -0.0303073 0.0347517 -0.0972046 0.117536 -0.0252372 0.0760959 0.0090216 -0.0484676 -0.0242083 -0.0482828 -0.168333 0.107888 -0.0022861 -0.0013708 -0.0118785 0.0306026 -0.0399363 -0.0047227 -0.0410089 -0.1329789 0.3371306 0.1346074 0.1866814 0.063523 0.2667161 -0.0031445 0.2321801 -0.0034754 0.2512269 0.0577391 0.0773019 -0.0232428 0.0700383 -0.0121436 0.039839 -0.0235754 0.0272625 0.1308055 0.0192387 0.0711212 -0.014698 0.1106235 -0.0713698 0.0522952 -0.0221125 0.0529213 0.1376657 -0.003843 -0.0215831 0.1268222 -0.0007267 0.0424458 -0.0350318 0.131748 0.0219556 -0.0268691 -0.0529838 0.1792129 -0.0617551 0.0709825 -0.0409296 0.0553812 -0.0352406 0.0787918 0.0828926 0.0868879 -0.0799461 -0.0624943 -0.0682431 0.0590387 -0.0082181 -0.0528908 -0.0596194 0.0003579 0.0162899 -0.0827933 0.0217457 -0.1013732 -0.0702645 0.0555399 0.0218328 0.05387 0.1478416 -0.1487255 -0.0135986 0.0053093 -0.0049482 0.089461 0.0167348 0.0011998 0.0151209 0.1520478 0.0986616 0.003107 -0.0614176 0.0704912 0.1208131 -0.1077248 -0.1100678 0.0058951 0.2831528 0.0259832 -0.0461111 -0.0548418 -0.1015579 -0.0051022 -0.1198885 -0.115736 -0.1088444 -0.0225081 -0.1256801 -0.0671744 -0.001762 -0.0401048 0.0706466 0.0505368 0.1418214 0.1141987 -0.0836044 -0.122591 0.022608 -0.0721724 0.1795981 -0.1404953 0.0965214 -0.0275079 0.0163907 0.0746977 0.3223119 -0.0079171 -0.0916397 -0.0294422 0.1906408 0.1240088 -0.1247338 0.1520575 0.2350349 unknown
polarizability: 149.2614241|9.5091069|120.8569513|6.7164635|2.5942781|75.5707324 unknown
InChI: InChI=1S/C9H12N2O/c1-7-5-3-4-6-8(7)9(10-2)11-12/h3-6,11-12H,1-2H3
charge 0 multiplicity 1
24 atoms
O  1.378547 -2.13779 -1.374174
N  2.025861 -0.937528 -0.824462
N  1.949939 0.737057 0.884797
C  -0.176048 -0.126381 0.050451
C  -0.914331 1.06942 -0.210313
C  -0.861969 -1.337045 0.330024
C  -2.330956 0.998237 -0.188698
C  1.325135 -0.104733 0.093233
C  -0.233703 2.394679 -0.503025
C  -2.271928 -1.381737 0.359788
C  -3.010453 -0.206997 0.095455
C  3.429442 0.758376 0.910743
H  -0.284161 -2.244348 0.528265
H  -2.906586 1.908743 -0.394189
H  0.525864 2.297992 -1.300776
H  -0.971818 3.153086 -0.816524
H  0.301201 2.758206 0.391227
H  -2.785716 -2.322371 0.58594
H  -4.106165 -0.227195 0.110364
H  2.993443 -1.190746 -0.594972
H  3.755115 1.467379 1.688532
H  3.861172 1.091542 -0.058402
H  3.885916 -0.230375 1.154516
H  0.974399 -1.823169 -2.226596
