program: Gaussian 09
title: 000271090
version: EM64L-G09RevD.01
frameworkgroup: C1[X(C17H16N2O)]
method: RPBEPBE
basis: SDD
operation: Freq
keyword: #p
keyword: freq=noraman
keyword: PBEPBE/SDD
title: #p freq=noraman PBEPBE/SDD
converged: YES YES NO NO
title: Mulliken charges:
elementType: O N N C C C C C C C C C C C C C C C C C H H H H H H H H H H H H H H H H
charge: -0.247513 -0.078982 -0.097713 0.321415 -0.100560 0.323917 0.059823 -0.367897 -0.341448 -0.306247 -0.360559 -0.242333 -0.251749 -0.237826 -0.245370 -0.234386 -0.227079 0.212321 -0.754792 -0.753442 0.297017 0.278000 0.254228 0.273455 0.228582 0.227104 0.230007 0.229716 0.230832 0.231120 0.230063 0.247277 0.232320 0.250183 0.262318 0.228200
chargesum: 0.00000
title: Mulliken charges with hydrogens summed into heavy atoms:
elementType: O N N C C C C C C C C C C C C C C C C C
charge: -0.247513 -0.078982 -0.097713 0.321415 -0.100560 0.323917 0.059823 -0.070880 -0.063448 -0.052019 -0.087104 -0.013752 -0.024645 -0.007819 -0.015654 -0.003554 0.004041 0.212321 -0.045132 -0.012741
polarizability: 2.68564253e+02 3.63281316e+00 2.25629343e+02 9.04790268e+00 -2.17674040e+01 1.57098861e+02
1716.lowfreq: -8.3618 -1.5829 -0.0007 -0.0005 0.0005 4.4318 21.6297 23.3577 43.4612
frequency: 21.4194 23.2269 43.4496 46.0928 57.5798 89.8074 108.2271 125.0929 146.1382 159.8390 181.5490 195.6254 232.4796 260.7771 295.5911 310.6254 349.8126 398.9772 400.1834 402.3554 415.6730 441.5841 456.6992 504.4315 540.3251 556.6432 613.3064 615.0569 658.8761 666.0129 690.2074 699.5138 704.3694 713.4463 779.6344 783.4360 808.5883 847.2575 856.3275 863.1222 931.7721 946.4888 948.1714 960.0621 963.6281 987.1433 987.9374 989.7528 994.2893 1004.4466 1005.9970 1020.6866 1028.9712 1058.0863 1079.5367 1084.0702 1086.3268 1127.3674 1172.8957 1174.5307 1187.6124 1198.8761 1207.2662 1270.9420 1291.9093 1318.1766 1328.9444 1374.1834 1381.7512 1386.5473 1393.7503 1431.9824 1434.0161 1449.1268 1455.7058 1459.9430 1467.8542 1475.9951 1476.6985 1527.7764 1540.7379 1576.8258 1588.8375 1605.3285 1606.8477 1612.4191 2971.9683 2975.7283 3048.3370 3054.5342 3098.6325 3111.5840 3125.1856 3127.9394 3137.1927 3140.8896 3153.3399 3153.7193 3164.0408 3165.2415 3177.3045 3178.8439
redmass: 4.8843 4.6753 3.7596 3.6210 3.8729 3.1003 2.9880 1.5900 3.6187 3.6029 1.2249 3.6840 4.0814 4.9165 4.1250 5.2504 3.6797 3.4963 3.2290 3.1794 3.8025 3.9028 4.3221 5.0514 5.4105 5.2465 6.4201 6.4179 5.5806 6.8981 2.6271 2.2373 3.5198 1.9341 1.9424 4.2278 3.0989 6.0116 1.2492 1.2426 2.0005 1.4609 1.4104 1.5804 1.4638 1.4662 5.7280 5.0823 1.3834 1.3370 1.3236 2.9241 2.2930 2.3555 1.6547 1.6787 1.5923 2.5437 1.0658 1.0548 1.2037 1.2897 2.3255 4.0607 4.0309 1.3408 1.5019 6.3273 1.2434 8.9896 1.2526 2.3582 2.2748 1.0758 1.1029 1.0534 1.1171 2.1392 2.1230 7.3604 9.4146 5.9030 6.3697 5.8718 6.0451 6.4286 1.0374 1.0376 1.0967 1.0962 1.1001 1.0985 1.0851 1.0853 1.0897 1.0890 1.0943 1.0937 1.0980 1.0979 1.0963 1.0970
irintensity: 1.5064 1.6594 0.0271 1.3424 2.2566 1.5074 1.1747 0.9536 0.3658 1.7004 0.6246 0.7829 4.9712 1.3122 2.6328 9.9489 2.9940 1.5825 0.4384 0.6329 0.2146 0.3999 1.6683 4.3700 10.9174 13.1699 0.4695 0.1014 88.0892 16.8602 18.5053 52.9059 48.0322 18.1415 69.2072 6.9403 7.7111 96.3952 2.1505 0.5641 12.6654 4.4715 3.8940 12.9632 1.8674 1.2268 0.0860 2.0458 0.5102 0.6265 0.7163 3.9471 8.4966 5.5292 5.9893 9.9282 12.5661 7.8909 6.2332 0.5132 79.3659 50.6422 62.8970 84.4866 106.1442 5.8879 15.6378 1.2463 53.2922 4.8042 13.3283 8.5659 26.6781 15.1094 18.7181 11.3246 15.2307 18.3987 9.2864 5.7658 135.4274 2.6047 9.6124 5.1050 22.0323 22.9922 15.7316 30.7878 14.1686 10.3806 21.5261 17.9800 0.1132 0.2773 18.0324 11.0258 20.1757 16.9877 20.6198 30.8660 19.7501 7.2577
temp: 298.150 k
press: 1.00000 atm
elementType: 8 7 7 6 6 6 6 6 6 6 6 6 6 6 6 6 6 6 6 6 1 1 1 1 1 1 1 1 1 1 1 1 1 1 1 1
symmnumber: 1
zpe: 744376.6 jmol-1
zpe.correction: 0.283518 hartree
zpe.thermalcorrener: 0.302104 hartree
zpe.thermalcorrenthalpy: 0.303048 hartree
zpe.thermalcorrgfe: 0.234273 hartree
zpe.sumelectzpe: -840.686423 hartree
zpe.sumelectthermal: -840.667837 hartree
zpe.sumelectthermalent: -840.666892 hartree
zpe.sumelectthermalfe: -840.735668 hartree
dipole: -1.3120 2.3925 -0.9819
dipole: 2.8999
quadrupole: -96.4118 -108.9686 -115.4874
quadrupole: -1.2729 -1.4216 2.0534
quadrupole: 10.5441 -2.0127 -8.5315 -1.2729 -1.4216 2.0534
hfenergy: -840.9699406 hartree
pointgroup: C01 [X(C17H16N2O1)]
dipole: -0.6552936 -0.6779823 0.6423398 debye
polarizability: 262.7730351|-18.3016849|214.3426803|-17.4063811|-33.5210129|174.1767422 unknown
InChI: InChI=1S/C17H16N2O/c1-13(2)18-19-16(14-9-5-3-6-10-14)17(20)15-11-7-4-8-12-15/h3-12H,1-2H3
charge 0 multiplicity 1
36 atoms
O  1.085368 0.794089 -2.010672
N  -0.399785 -1.10237 0.382774
N  -1.48089 -1.529114 1.110616
C  -1.270179 1.232739 -0.092009
C  -0.275822 0.118303 -0.127578
C  2.31948 -0.195364 -0.19518
C  1.054169 0.2777 -0.8488
C  -1.243001 2.286923 -1.052663
C  -2.234969 1.298716 0.958811
C  2.425897 -0.454207 1.198246
C  3.475774 -0.320588 -1.014551
C  -2.151934 3.36207 -0.963714
C  -3.128544 2.384784 1.048709
C  -3.097718 3.420288 0.085336
C  3.66523 -0.832363 1.756965
C  4.708555 -0.710365 -0.45706
C  4.806868 -0.967089 0.932613
C  -2.288913 -2.46264 0.652807
C  -3.33144 -3.016484 1.594105
C  -2.216777 -2.983788 -0.768489
H  -0.517888 2.243293 -1.868847
H  -2.271367 0.50016 1.705288
H  1.546075 -0.358918 1.839587
H  3.378757 -0.101235 -2.082986
H  -2.119973 4.156393 -1.717816
H  -3.852846 2.421133 1.870293
H  -3.801588 4.257622 0.150817
H  3.741233 -1.024552 2.832718
H  5.59174 -0.812218 -1.097184
H  5.766483 -1.26656 1.369255
H  -4.348156 -2.883833 1.177129
H  -3.278157 -2.518358 2.575024
H  -3.183626 -4.104654 1.737753
H  -2.743392 -2.305769 -1.468215
H  -1.162633 -3.032007 -1.100574
H  -2.680732 -3.980534 -0.851413
