program: Gaussian 09
title: 000271087
version: EM64L-G09RevD.01
frameworkgroup: C1[X(C13H15N3)]
method: RPBEPBE
basis: SDD
operation: Freq
keyword: #pfreq=noraman
keyword: PBEPBE/SDD
title: #p freq=noraman PBEPBE/SDD
converged: YES YES NO NO
title: Mulliken charges:
elementType: N N N C C C C C C C C C C C C C H H H H H H H H H H H H H H H
charge: -0.492686 -0.743342 -0.004499 0.031019 0.484735 0.272959 0.262764 -0.492852 -0.469574 -0.407220 -0.425571 -0.211944 -0.233045 0.162046 -0.769542 -0.792356 0.234497 0.237894 0.275555 0.217280 0.219793 0.223622 0.400176 0.315975 0.300547 0.220712 0.250253 0.222821 0.240449 0.227378 0.242153
chargesum: 0.00000
title: Mulliken charges with hydrogens summed into heavy atoms:
elementType: N N N C C C C C C C C C C C C C
charge: -0.092510 -0.126821 -0.004499 0.031019 0.484735 0.272959 0.262764 -0.258355 -0.231680 -0.131665 -0.208291 0.007850 -0.009423 0.162046 -0.075755 -0.082375
polarizability: 2.80158411e+02 4.98225932e+00 1.97126542e+02 -5.96082229e+00 2.48615897e+00 7.88111886e+01
1716.lowfreq: -8.7810 -1.6430 -0.0006 -0.0005 0.0005 1.0073 49.1070 49.9677 86.4124
frequency: 49.0771 49.9516 86.4116 108.1930 134.0519 161.7131 187.2565 218.9003 239.5590 244.3409 254.5481 266.1061 330.4708 347.8600 395.9153 461.2234 470.4166 479.9927 503.5307 509.0480 514.0513 553.4778 582.7330 610.1343 643.0872 697.7203 737.5641 760.8047 769.7856 780.7435 807.5170 833.7847 856.8381 877.1667 889.9182 902.8583 958.9915 960.7844 967.0917 980.0371 986.6432 1022.4477 1044.2235 1073.4103 1079.5726 1114.3454 1130.4864 1142.2313 1176.1514 1187.3139 1232.3434 1264.0131 1274.2706 1321.4267 1356.7458 1381.3506 1394.0250 1403.5177 1404.2567 1429.5574 1450.7442 1454.9692 1461.7760 1466.5468 1473.4427 1500.1963 1548.7588 1595.1339 1600.4015 1601.9899 1618.6148 1644.2946 2952.1247 2961.2326 3021.9889 3030.3405 3098.7447 3107.5706 3114.5419 3125.4471 3129.3898 3149.1533 3156.3024 3186.2654 3238.3983 3428.9233 3556.6795
redmass: 3.3115 3.3302 3.8998 2.6629 1.1947 3.6887 1.1313 1.9028 3.5148 3.4400 3.6525 1.7010 3.6501 4.4481 2.7805 3.7475 4.4965 3.7905 4.0089 3.8920 5.6389 5.6318 4.4258 3.4107 3.1736 5.2549 1.3016 1.9994 1.9102 2.5408 3.7284 2.2128 3.6941 1.4293 1.1541 1.4403 1.3359 1.3224 1.3394 1.3482 3.4121 3.3952 2.2892 1.6093 1.9401 1.8133 1.4882 2.0281 1.1708 1.3227 1.7043 3.5853 2.4852 2.2955 2.5618 1.2809 1.3192 5.3877 3.9684 2.1298 1.4671 1.7705 1.0496 1.0954 1.0520 2.3277 2.5681 6.3116 5.9023 4.5850 3.3429 1.3388 1.0393 1.0385 1.0968 1.0972 1.0961 1.0968 1.0877 1.0863 1.0892 1.0965 1.0994 1.0935 1.0805 1.0468 1.0957
irintensity: 1.3620 0.1256 2.4270 7.4671 3.4825 1.3015 3.5807 39.7458 3.8167 4.0601 2.8520 32.8475 3.7467 6.8718 5.3725 1.7169 0.2314 0.8095 6.4653 1.8539 0.1259 0.4579 13.9445 3.5984 8.4810 1.2496 80.0516 78.1899 28.1851 16.9694 12.7860 153.0530 10.1343 12.6794 61.4297 2.7127 2.8771 6.3754 0.9105 4.6876 24.2214 20.0389 9.5788 5.1088 5.3534 32.6427 3.3150 139.5442 3.5260 6.2213 5.4705 14.5189 23.5332 42.0135 12.8025 45.2446 2.3603 70.4342 19.7852 49.3680 14.7503 51.2469 20.6559 26.6330 13.1204 29.3518 231.1161 115.5540 27.6846 87.5658 62.0536 31.6064 19.9372 73.3687 21.7693 29.5662 19.6733 19.6087 13.3567 8.1358 8.7487 35.8360 39.8175 2.9213 134.1896 5.3466 8.2890
temp: 298.150 k
press: 1.00000 atm
elementType: 7 7 7 6 6 6 6 6 6 6 6 6 6 6 6 6 1 1 1 1 1 1 1 1 1 1 1 1 1 1 1
symmnumber: 1
zpe: 665578.0 jmol-1
zpe.correction: 0.253505 hartree
zpe.thermalcorrener: 0.268370 hartree
zpe.thermalcorrenthalpy: 0.269314 hartree
zpe.thermalcorrgfe: 0.211857 hartree
zpe.sumelectzpe: -667.474022 hartree
zpe.sumelectthermal: -667.459157 hartree
zpe.sumelectthermalent: -667.458213 hartree
zpe.sumelectthermalfe: -667.515670 hartree
dipole: -1.2748 -3.8508 0.6256
dipole: 4.1043
quadrupole: -83.6202 -81.7398 -99.2942
quadrupole: 3.4987 -0.6012 -2.7038
quadrupole: 4.5978 6.4783 -11.0761 3.4987 -0.6012 -2.7038
hfenergy: -667.7275273 hartree
pointgroup: C01 [X(C13H15N3)]
dipole: 0.4523572 -1.5494148 -0.0461465 debye
polarizability: 279.8539364|-8.1087293|195.136771|-1.7474276|-17.023457|81.105434 unknown
InChI: InChI=1S/C13H15N3/c1-9(2)15-16-12-8-4-6-10-5-3-7-11(14)13(10)12/h3-8,16H,14H2,1-2H3
charge 0 multiplicity 1
31 atoms
N  1.441859 -0.119693 0.016943
N  -0.091578 -2.348107 -0.110498
N  2.679984 0.501208 -0.041478
C  -1.024432 -0.015662 -0.070753
C  -2.211394 0.824837 -0.05804
C  0.272404 0.640751 -0.1610
C  -1.214353 -1.446412 0.043062
C  -2.09278 2.23795 -0.260515
C  -3.498041 0.235499 0.182365
C  0.347077 2.032752 -0.368995
C  -2.486871 -1.981154 0.298069
C  -0.833748 2.817773 -0.437625
C  -3.630145 -1.135798 0.394578
C  3.750842 -0.223646 0.225005
C  5.08984 0.472754 0.144357
C  3.713211 -1.697462 0.602044
H  -3.001258 2.850226 -0.263686
H  -4.376176 0.890798 0.206147
H  1.335786 2.490381 -0.440298
H  -2.605528 -3.068663 0.384512
H  -0.743453 3.89778 -0.600576
H  -4.612292 -1.576887 0.596457
H  1.304862 -1.112229 0.287856
H  0.327304 -2.338089 -1.049268
H  -0.296041 -3.303184 0.200556
H  5.751185 -0.013911 -0.60005
H  4.951046 1.527513 -0.141921
H  5.619272 0.435062 1.11715
H  3.076163 -1.875933 1.492423
H  3.299379 -2.317344 -0.220051
H  4.724175 -2.071712 0.828529
