program: Gaussian 09
title: 000271084
version: EM64L-G09RevD.01
frameworkgroup: C1[X(C13H8N4O3)]
method: RPBEPBE
basis: SDD
operation: Freq
keyword: #p
keyword: freq=noraman
keyword: PBEPBE/SDD
title: #p freq=noraman PBEPBE/SDD
converged: YES YES NO NO
title: Mulliken charges:
elementType: O O O N N N N C C C C C C C C C C C C C H H H H H H H H
charge: -0.240719 -0.206669 -0.207871 -0.334341 -0.016911 -0.081760 0.022280 0.458432 0.130225 0.184793 0.054910 -0.301370 -0.329043 -0.300899 0.398231 -0.298088 -0.372490 -0.360233 -0.221127 -0.197641 0.306665 0.291932 0.281941 0.269416 0.288887 0.289433 0.245715 0.246303
chargesum: 0.00000
title: Mulliken charges with hydrogens summed into heavy atoms:
elementType: O O O N N N N C C C C C C C C C C C C C
charge: -0.240719 -0.206669 -0.207871 -0.334341 -0.016911 -0.081760 0.022280 0.458432 0.130225 0.184793 0.054910 0.005295 -0.037110 -0.018959 0.398231 -0.028672 -0.083603 -0.070800 0.024587 0.048662
polarizability: 3.79641141e+02 -4.00973782e-01 1.79420163e+02 -3.98090043e-01 3.82775536e+00 7.08531729e+01
1716.lowfreq: -2.5862 -0.0010 -0.0009 -0.0003 3.8085 5.3698 25.3152 30.1702 65.9903
frequency: 25.2330 30.1647 65.9901 70.3975 110.4691 125.6567 194.2163 210.6778 216.4385 230.6040 301.1910 338.8734 367.3647 408.5732 420.3751 425.3443 456.9329 473.3920 494.9037 518.2384 527.6409 541.0673 605.5791 606.7765 626.0587 663.8322 677.5382 680.0300 723.1398 737.5611 777.5597 788.3873 791.6161 814.1916 841.1800 860.0427 880.2338 903.9440 915.3924 986.2200 988.3391 994.1511 1000.9504 1012.3659 1016.1997 1049.6249 1096.9906 1100.9601 1123.9978 1168.8314 1184.7897 1195.7368 1218.3901 1223.4071 1267.8025 1280.4930 1302.0195 1360.8938 1387.3770 1403.1436 1420.1827 1436.8101 1445.3362 1463.4554 1479.0352 1568.2724 1592.3190 1604.0654 1608.7805 1612.5108 3146.5834 3160.2324 3173.3408 3181.2966 3182.3885 3182.7998 3204.5538 3218.1976
redmass: 5.9827 8.2136 8.4738 7.1789 7.6639 5.8050 7.6544 6.9391 9.7641 7.9541 6.5152 7.4943 6.8108 2.9796 3.5035 8.3900 4.5454 10.2220 8.0536 6.4705 3.8787 9.9777 5.2034 9.0122 7.2303 4.6114 4.3470 7.3341 7.7906 5.0576 4.1585 8.3061 1.4707 6.6709 1.2564 2.2268 3.9105 1.4328 7.7954 1.3749 1.3365 1.3931 3.3574 1.3538 2.6842 3.3905 2.9944 2.0272 1.2733 1.1705 1.4680 2.4338 2.8554 3.8578 5.1100 1.7461 1.3152 7.7807 9.2926 10.8557 5.4192 4.9726 2.5426 2.8635 2.4543 7.2624 8.1641 6.4259 10.2873 6.9041 1.0870 1.0906 1.0957 1.0902 1.1002 1.0914 1.0954 1.0949
irintensity: 0.4219 0.4936 2.6558 2.0050 3.7622 0.8486 2.5955 1.7409 0.4543 0.7004 2.5931 1.8944 2.5971 0.4216 0.9438 7.7976 0.8237 22.5359 2.3335 5.3269 15.6364 17.3913 11.5678 8.7726 3.6512 33.4806 10.5170 35.9767 31.5949 3.4508 13.4378 48.4666 61.8136 83.3867 2.1833 64.6063 71.9252 0.1288 62.4856 2.8266 1.5126 3.6832 4.9187 0.1664 10.8281 19.1381 27.1516 7.7890 23.0862 4.4443 106.8176 14.7414 100.4460 370.2615 111.4503 1.2449 0.3077 94.0758 94.9893 15.2278 12.4692 64.3862 25.9945 4.2391 54.9661 29.0461 1.9775 94.4471 175.4852 12.3402 3.1259 6.1284 3.2723 0.5849 17.9395 1.9075 1.1655 2.7798
temp: 298.150 k
press: 1.00000 atm
elementType: 8 8 8 7 7 7 7 6 6 6 6 6 6 6 6 6 6 6 6 6 1 1 1 1 1 1 1 1
symmnumber: 1
zpe: 505360.3 jmol-1
zpe.correction: 0.192482 hartree
zpe.thermalcorrener: 0.207755 hartree
zpe.thermalcorrenthalpy: 0.208699 hartree
zpe.thermalcorrgfe: 0.148169 hartree
zpe.sumelectzpe: -943.376263 hartree
zpe.sumelectthermal: -943.360989 hartree
zpe.sumelectthermalent: -943.360045 hartree
zpe.sumelectthermalfe: -943.420575 hartree
dipole: 9.0298 -0.0249 -0.0069
dipole: 9.0299
quadrupole: -119.7423 -116.1493 -115.0613
quadrupole: 3.6025 -0.9508 2.6317
quadrupole: -2.7580 0.8349 1.9230 3.6025 -0.9508 2.6317
hfenergy: -943.5687441 hartree
pointgroup: C01 [X(C13H8N4O3)]
dipole: -3.5525993 -0.0082043 -0.0114268 debye
polarizability: 379.6396843|0.3338617|178.9766147|0.8434171|-7.9091984|71.2981786 unknown
InChI: InChI=1S/C13H8N4O3/c18-13-11-3-1-2-4-12(11)14-15-16(13)9-5-7-10(8-6-9)17(19)20/h1-8H
charge 0 multiplicity 1
28 atoms
O  -0.983565 2.092768 0.164746
O  5.794451 1.202227 -0.27262
O  5.881971 -0.986485 0.367589
N  -0.487753 -0.219555 -0.065329
N  -0.928837 -1.614106 -0.19931
N  -2.195177 -1.881501 -0.214487
N  5.23267 0.080707 0.036704
C  0.950529 -0.113817 -0.034759
C  -2.806458 0.511005 0.025036
C  -1.38145 0.8989 0.047862
C  -3.172967 -0.859909 -0.103512
C  1.611625 1.09638 -0.382259
C  1.7116 -1.258928 0.332347
C  -3.81798 1.497041 0.133594
C  3.753253 0.012615 0.008835
C  -4.537718 -1.246827 -0.12558
C  3.01675 1.157216 -0.359175
C  3.113455 -1.197648 0.355375
C  -5.171249 1.111801 0.113658
C  -5.531593 -0.259326 -0.016127
H  1.033237 1.980643 -0.646705
H  1.197009 -2.185609 0.589155
H  -3.517994 2.544598 0.232351
H  -4.778711 -2.308964 -0.22731
H  3.545539 2.076627 -0.622639
H  3.716178 -2.063686 0.639885
H  -5.954468 1.872131 0.198184
H  -6.588345 -0.5447 -0.03071
