program: Gaussian 09
title: 000271082
version: EM64L-G09RevD.01
frameworkgroup: C1[X(C7H8N2O)]
method: RPBEPBE
basis: SDD
operation: Freq
keyword: #pfreq=noraman
keyword: PBEPBE/SDD
title: #p freq=noraman PBEPBE/SDD
converged: NO NO NO NO
title: Mulliken charges:
elementType: O N N C C C C C C C H H H H H H H H
charge: -0.293750 -0.052077 -0.076831 0.396322 -0.329848 -0.364785 -0.197221 -0.194937 -0.234582 -0.664591 0.289051 0.289726 0.233910 0.234847 0.234315 0.249695 0.231136 0.249621
chargesum: 0.00000
title: Mulliken charges with hydrogens summed into heavy atoms:
elementType: O N N C C C C C C C
charge: -0.293750 -0.052077 -0.076831 0.396322 -0.040797 -0.075060 0.036689 0.039910 -0.000266 0.065861
polarizability: 1.42512952e+02 -4.57891752e+00 1.00402691e+02 5.51979868e-03 8.59360812e-04 4.10693012e+01
1716.lowfreq: -8.9249 -0.0010 -0.0008 0.0002 10.3351 11.5670 55.2630 121.8548 166.1051
frequency: 55.1659 121.8346 166.0938 184.7066 250.0898 339.6076 363.4331 407.8976 466.2548 477.3181 611.0740 659.4033 664.5699 691.9486 782.4404 811.8463 857.3189 952.3259 967.7394 989.6446 993.9397 1005.5729 1019.3639 1047.2817 1073.5776 1091.4724 1149.1483 1171.3773 1174.3205 1232.3172 1302.4045 1348.3965 1395.5788 1418.3272 1442.6848 1445.6709 1455.9212 1465.4323 1601.0207 1608.7521 2957.2577 3026.6146 3127.7507 3135.2230 3148.3655 3164.5910 3184.3722 3189.5365
redmass: 4.8981 3.6712 1.0848 3.7208 3.8170 4.3603 6.1181 2.8926 3.5132 6.8703 6.4375 5.4206 6.0095 2.0305 1.7129 4.3081 1.2424 1.4010 7.5301 6.3096 1.3703 1.3177 2.0821 1.3520 1.5102 2.4263 1.8894 1.0639 1.2789 6.6595 1.3789 3.8425 8.8700 1.3155 1.0463 1.3278 1.7369 2.2191 6.2061 7.1818 1.0364 1.0967 1.0986 1.0859 1.0908 1.0964 1.0951 1.0966
irintensity: 0.6521 2.2890 0.4449 2.5008 4.1882 19.0778 0.7142 0.0021 1.2506 2.6329 0.0994 22.0528 7.1344 53.4076 56.3802 5.5576 0.0494 8.6269 2.4308 0.1163 0.0137 1.6995 12.1663 0.2564 22.1677 8.7379 4.8591 0.6593 18.4521 48.0156 1.1236 65.1676 1.2876 10.2269 15.7413 0.1070 36.7357 17.6447 0.3943 0.3333 20.3250 22.8559 23.3589 0.4289 18.4839 19.3889 3.3850 7.2358
temp: 298.150 k
press: 1.00000 atm
elementType: 8 7 7 6 6 6 6 6 6 6 1 1 1 1 1 1 1 1
symmnumber: 1
zpe: 366039.3 jmol-1
zpe.correction: 0.139417 hartree
zpe.thermalcorrener: 0.148171 hartree
zpe.thermalcorrenthalpy: 0.149116 hartree
zpe.thermalcorrgfe: 0.105312 hartree
zpe.sumelectzpe: -455.466079 hartree
zpe.sumelectthermal: -455.457324 hartree
zpe.sumelectthermalent: -455.456380 hartree
zpe.sumelectthermalfe: -455.500184 hartree
dipole: -1.4407 -1.1986 0.0015
dipole: 1.8741
quadrupole: -46.3540 -57.6788 -61.2793
quadrupole: -3.2942 0.0023 -0.0058
quadrupole: 8.7500 -2.5747 -6.1753 -3.2942 0.0023 -0.0058
hfenergy: -455.6054958 hartree
pointgroup: C01 [X(C7H8N2O1)]
dipole: -0.5703638 0.4654564 -0.0407735 debye
dipolederiv: -0.5580342 0.1773012 -0.0168757 -0.1496629 -0.764034 0.031196 0.004401 0.0360964 -0.2541318 0.7559 -0.0510187 0.0144257 0.0106114 0.8149936 -0.046106 0.0112594 -0.0466876 0.1088918 -0.3538615 -0.1336624 0.0065424 -0.2063931 -0.5035467 0.0135348 0.0103985 0.0143909 -0.2438397 -0.0018532 0.049124 -0.0038344 0.084153 0.0411111 0.0010498 -0.0063218 0.0004833 0.0371133 -0.0272671 0.0817995 -0.0038218 -0.0756357 -0.0518895 -0.0054115 0.0062886 -0.0027571 -0.1143697 0.0102379 -0.1040583 0.0092402 0.0609738 -0.0481982 -0.0043056 -0.0016888 -0.0070829 -0.1283396 -0.1282213 -0.120698 0.0083879 -0.1337051 0.1085709 -0.0194529 0.0092273 -0.0192543 -0.1508573 -0.0585993 0.1567718 -0.0086643 0.1878223 0.0611237 -0.0106486 -0.0106504 -0.0111153 -0.1494985 0.1217382 -0.0159553 0.0056146 -0.0140965 -0.0103738 -0.0089604 0.0053575 -0.0089999 -0.1426735 0.1058969 0.1126231 -0.0085661 0.3424903 0.2262078 0.0032846 -0.0220051 0.0004105 0.1924716 0.1125846 -0.0732088 0.0038352 -0.0588132 0.0562509 0.0064235 0.002965 0.0061867 0.1685511 0.1481222 0.0641237 -0.0047115 0.0368861 0.0453271 0.0091566 -0.0029689 0.0095786 0.1741614 0.034764 0.0683177 -0.0065825 0.086512 -0.0726637 0.0166077 -0.0077738 0.0163237 0.1561166 0.0027819 -0.0872906 0.003065 -0.1018915 -0.0398821 0.0112444 0.0040361 0.0114895 0.1574054 -0.120038 0.0195396 -0.0061125 0.0213951 0.0959159 0.0046785 -0.0062477 0.0046383 0.1611802 -0.0275419 -0.0413549 -0.0108328 0.022963 0.0662762 0.1045548 -0.0779453 0.052481 -0.0544927 0.0140157 -0.0647028 0.0023488 -0.1498797 -0.0702526 0.0089668 0.007506 0.0104271 0.1131158 -0.0306248 -0.0376508 0.0165416 0.0362709 0.0450635 -0.1158126 0.0741623 -0.0666087 -0.0308046 unknown
polarizability: 142.4105483|5.0061293|100.2326884|1.3792575|-3.7975058|41.3417074 unknown
InChI: InChI=1S/C7H8N2O/c1-8-9(10)7-5-3-2-4-6-7/h2-6H,1H3
charge 0 multiplicity 1
18 atoms
O  1.840602 -1.479206 0.175743
N  1.369513 -0.249112 0.088378
N  2.098146 0.850575 0.028206
C  -0.09924 -0.068996 0.051452
C  -0.657768 1.22468 -0.043212
C  -0.900217 -1.227943 0.113747
C  -2.062295 1.350521 -0.075713
C  -2.304151 -1.083732 0.079966
C  -2.8873 0.201418 -0.014452
C  3.545839 0.559639 0.070714
H  0.004083 2.092565 -0.089007
H  -0.415188 -2.204678 0.186314
H  -2.512744 2.346203 -0.148979
H  -2.940432 -1.973825 0.127388
H  -3.977197 0.308181 -0.040154
H  3.824003 0.016038 0.996362
H  4.071597 1.523575 0.018933
H  3.853149 -0.093504 -0.771286
