program: Gaussian 09
title: 000271078
version: EM64L-G09RevD.01
frameworkgroup: C1[X(C9H8N2)]
method: RPBEPBE
basis: SDD
operation: Freq
keyword: #p
keyword: freq=noraman
keyword: PBEPBE/SDD
title: #p freq=noraman PBEPBE/SDD
converged: YES YES NO NO
title: Mulliken charges:
elementType: N N C C C C C C C C C H H H H H H H H
charge: -0.473953 -0.065723 0.269537 0.013754 0.201232 -0.356281 -0.337685 -0.212746 -0.230330 -0.201108 -0.528398 0.304782 0.232619 0.249736 0.224132 0.225791 0.218809 0.215838 0.249995
chargesum: 0.00000
title: Mulliken charges with hydrogens summed into heavy atoms:
elementType: N N C C C C C C C C C
charge: -0.169171 -0.065723 0.269537 0.013754 0.201232 -0.123662 -0.087948 0.011386 -0.004539 0.017701 -0.062565
polarizability: 2.03537914e+02 -5.68578649e+00 1.08352679e+02 1.96736615e-02 -2.05990614e-02 4.33680909e+01
1716.lowfreq: -12.1487 -0.0007 -0.0006 0.0006 4.7878 9.3113 80.9307 155.0809 159.8639
frequency: 80.9289 155.0802 159.8639 253.5640 306.8092 353.3139 432.2206 463.3989 554.6274 573.6051 578.4699 600.7743 611.9212 672.2757 747.4699 760.2464 768.7993 817.8559 855.9774 881.1750 935.9856 952.7192 955.7768 976.6496 984.3703 1005.8652 1055.3509 1112.9518 1160.0306 1177.9191 1220.6321 1261.3955 1283.2538 1305.7291 1335.6860 1412.3938 1415.0357 1435.7139 1477.2275 1517.0141 1589.5019 1631.6636 1645.8225 3098.7664 3113.8352 3129.9459 3142.6310 3158.0551 3172.4818 3224.4479 3592.5807
redmass: 3.8493 2.4227 3.4067 4.6434 3.0935 4.0335 2.7741 5.3888 4.2518 2.8899 2.0693 1.3024 6.6577 3.9415 1.6638 2.4869 3.3910 4.2339 1.4962 6.1334 1.3796 4.2803 1.3936 1.3053 1.0917 2.0680 1.7564 1.5653 1.1342 1.6807 2.8537 2.3430 2.6708 1.4678 2.2519 2.5087 1.4537 3.1980 3.5306 4.0841 6.5591 7.4266 5.1058 1.0746 1.0765 1.0854 1.0905 1.0958 1.0990 1.1165 1.0812
irintensity: 2.6340 2.1183 0.6130 5.8650 0.0416 1.5684 9.1290 0.5264 6.8331 0.2614 17.3625 87.3460 1.3737 0.6634 40.7394 73.8648 20.4104 2.3757 0.0481 1.4431 4.2512 1.7208 56.5640 0.2654 40.6855 4.7799 25.0769 3.0157 0.8237 12.2151 4.5511 35.2310 9.5350 6.1173 47.4874 11.7496 20.8000 6.1910 2.8635 16.6201 2.6284 1.6631 7.9256 14.5593 8.8779 0.0744 12.9220 26.6934 20.4925 11.8334 38.5966
temp: 298.150 k
press: 1.00000 atm
elementType: 7 7 6 6 6 6 6 6 6 6 6 1 1 1 1 1 1 1 1
symmnumber: 1
zpe: 389443.1 jmol-1
zpe.correction: 0.148331 hartree
zpe.thermalcorrener: 0.156861 hartree
zpe.thermalcorrenthalpy: 0.157806 hartree
zpe.thermalcorrgfe: 0.114775 hartree
zpe.sumelectzpe: -456.491327 hartree
zpe.sumelectthermal: -456.482797 hartree
zpe.sumelectthermalent: -456.481852 hartree
zpe.sumelectthermalfe: -456.524883 hartree
dipole: 0.3429 3.4348 0.0041
dipole: 3.4519
quadrupole: -53.4157 -55.0360 -69.8957
quadrupole: 4.3745 0.0017 -0.0136
quadrupole: 6.0334 4.4131 -10.4466 4.3745 0.0017 -0.0136
hfenergy: -456.639658 hartree
pointgroup: C01 [X(C9H8N2)]
dipole: 0.1321707 1.3516241 -0.0012085 debye
dipolederiv: -0.3573215 0.0364409 0.0003151 -0.1092584 -0.4891137 0.0006783 0.0007923 0.0010855 -0.2832879 -0.4072679 -0.1843128 0.0004915 -0.0840774 -0.4524701 0.0003191 -0.0005832 0.0002698 -0.2640771 0.0726649 0.2212628 -0.0009992 0.2976667 0.0086865 -0.0003579 -0.0007358 -0.0000377 0.0682213 0.1952973 0.1105499 -0.000749 -0.1356055 -0.0592606 0.0002513 0.0003782 0.0000074 0.0243375 0.2165805 -0.1705798 0.0007348 -0.1962663 0.6426723 -0.0004176 0.0013099 -0.0005825 0.113509 0.1800611 -0.1202153 0.0002789 -0.0518385 0.0540342 -0.0004403 -0.0003112 -0.0003685 -0.1948548 0.185618 -0.0332796 0.000162 0.0596925 0.1074681 -0.000341 0.000005 -0.0004185 -0.1579591 -0.1304357 -0.0074991 -0.0002356 -0.2911913 0.0839039 -0.000508 0.0005316 -0.0003902 -0.176032 -0.1559315 0.0993 -0.0003511 0.3353283 -0.0305007 -0.0001759 -0.0005909 -0.0003329 -0.184277 0.3260422 0.0404018 0.0000506 0.2428591 0.1120999 -0.001819 -0.001026 -0.0020255 -0.1874342 -0.2762562 0.0737318 -0.0005299 0.1263419 0.0049753 -0.001982 -0.0015936 -0.0017687 -0.3389257 0.1717695 0.0056643 0.0000748 -0.0027968 0.1679861 0.0001778 -0.0000748 0.0000165 0.3560885 0.0698563 0.0035787 0.0000673 0.0503396 -0.1081965 0.0004666 -0.0000596 0.0004811 0.1819076 0.0918719 0.0356297 -0.0000282 -0.0089928 -0.0652429 0.0003395 0.000035 0.0003397 0.1669499 -0.1128199 0.0804441 0.0000089 0.0771233 0.0552824 0.0001288 0.0000923 0.0001287 0.1647474 -0.0798337 -0.1037183 0.0002711 -0.1083632 0.0129422 0.0002988 0.0002464 0.0003129 0.1659715 0.0285024 0.0000666 0.0000024 -0.1004551 -0.1170214 0.0016188 0.0003744 0.0016821 0.173734 -0.1098552 -0.0292397 0.0001227 -0.039112 0.0876565 0.0005229 0.000644 0.0004998 0.1782934 0.0914574 -0.0582261 0.0003129 -0.0613942 -0.0159015 0.0012397 0.0005659 0.0011009 0.1930876 unknown
polarizability: 203.5606721|-5.491861|108.3295503|0.0374003|-0.1561907|43.3684616 unknown
InChI: InChI=1S/C9H8N2/c1-2-9-10-7-5-3-4-6-8(7)11-9/h2-6,10H,1H2
charge 0 multiplicity 1
19 atoms
N  0.700592 1.323676 -0.002563
N  0.964276 -0.946797 0.000819
C  -0.596346 0.79825 -0.000755
C  -0.407598 -0.630582 0.001465
C  1.607643 0.241832 -0.000436
C  -1.874737 1.394171 -0.000974
C  -1.533635 -1.487985 0.003442
C  -2.981826 0.518846 0.001107
C  -2.813756 -0.89868 0.003265
C  3.051166 0.45992 -0.000842
C  3.969261 -0.546135 0.005371
H  0.95393 2.310284 -0.003743
H  -2.014406 2.480396 -0.002695
H  -1.398441 -2.573633 0.004995
H  -3.994891 0.936138 0.001001
H  -3.702895 -1.538571 0.00474
H  3.385491 1.507072 -0.006791
H  5.043602 -0.336286 0.004439
H  3.644172 -1.591812 0.011156
