program: Gaussian 09
title: 000271074
version: EM64L-G09RevD.01
frameworkgroup: C1[X(C12H20N2O4)]
method: RPBEPBE
basis: SDD
operation: Freq
keyword: #p
keyword: freq=noraman
keyword: PBEPBE/SDD
title: #p freq=noraman PBEPBE/SDD
converged: YES YES NO NO
title: Mulliken charges:
elementType: O O O O N N C C C C C C C C C C C C H H H H H H H H H H H H H H H H H H H H
charge: -0.438917 -0.297550 -0.330650 -0.247348 -0.405852 -0.457473 -0.028703 -0.009693 -0.528393 -0.477954 -0.460543 -0.409964 0.223613 0.151630 0.194215 -0.818683 -0.160045 -0.508395 0.243435 0.268865 0.210388 0.230981 0.202721 0.226047 0.200882 0.237526 0.222812 0.187926 0.358384 0.337531 0.358823 0.233035 0.233425 0.276175 0.267485 0.249337 0.232463 0.232464
chargesum: 0.00000
title: Mulliken charges with hydrogens summed into heavy atoms:
elementType: O O O O N N C C C C C C C C C C C C
charge: -0.101385 -0.297550 -0.330650 -0.247348 -0.047468 -0.098650 0.214732 0.259172 -0.087024 -0.049186 -0.022135 0.000774 0.223613 0.151630 0.194215 -0.076049 0.107440 0.205870
polarizability: 2.36321801e+02 -1.93103637e+01 1.58229018e+02 -3.03632089e+00 -7.77301370e+00 1.14901409e+02
1716.lowfreq: -29.2735 -9.7471 -5.8121 -2.3177 0.0004 0.0007 0.0009 10.2975 23.8807
frequency: -26.2953 7.8933 23.3253 42.8109 62.0571 70.4164 75.2901 108.7132 125.3276 136.6500 151.0292 165.0282 187.1276 202.3334 219.8599 239.1085 261.0349 308.2473 314.1125 354.6981 368.4625 377.3849 397.2924 425.8807 435.0005 445.5193 490.5433 560.2166 576.3080 648.3106 649.7428 704.7634 730.9426 735.4475 816.0929 830.8131 834.5496 869.0906 886.5080 891.2924 914.6578 916.1598 933.8635 950.9043 972.8730 977.7771 1001.2510 1018.5944 1043.1738 1055.6824 1073.7692 1101.3047 1111.4773 1112.6047 1122.2274 1146.2012 1155.9405 1185.0558 1194.6480 1203.6519 1215.7860 1240.7016 1265.3264 1268.0089 1271.7356 1290.0664 1302.3656 1308.7177 1318.3720 1337.2825 1347.1379 1355.9680 1377.1503 1400.5032 1427.7739 1438.8921 1463.0724 1464.6126 1467.9996 1468.5248 1470.8877 1475.8509 1479.8827 1489.0403 1516.0889 1573.9275 1665.6614 1667.1834 2936.2399 2966.8003 2974.1934 2979.4765 2981.8651 2988.6688 3001.5545 3033.2640 3038.9296 3052.4287 3060.5033 3068.3357 3075.5833 3077.4675 3105.3184 3111.5462 3138.1990 3284.6000 3544.3372 3555.6129
redmass: 2.5203 5.2182 5.0875 3.8004 4.0616 1.5887 5.2754 3.2527 3.5595 2.0004 3.8028 3.2012 1.1954 3.1242 2.7682 3.8915 4.6962 4.3233 1.2396 4.1731 3.8926 4.6897 3.9059 2.3728 2.5163 3.3487 3.9225 3.7558 2.8766 2.0727 2.1693 5.9000 4.0850 3.7312 1.8097 2.0764 1.2506 3.7012 1.8591 1.9303 3.7193 1.4747 3.2239 5.9012 2.7641 1.6223 1.7529 1.5351 1.4313 2.4059 2.4253 2.5483 2.6819 1.2498 1.5472 1.8538 2.0393 1.5369 1.8402 2.3109 1.9831 1.6625 1.4565 1.9634 1.3168 1.2937 1.3142 1.2532 1.2551 1.3828 1.5772 1.3876 1.2357 1.2367 2.2796 1.3410 1.0816 1.0543 1.0493 1.0865 1.0894 1.0743 1.0994 1.0449 2.7055 2.5147 5.6832 6.5420 1.0692 1.0396 1.0666 1.0316 1.0627 1.0643 1.0843 1.0883 1.0986 1.0969 1.0965 1.0957 1.1014 1.1053 1.0947 1.0932 1.1015 1.0821 1.0767 1.0658
irintensity: 0.9042 1.1821 0.0595 0.4698 1.6156 3.3436 3.3723 0.5517 4.6704 1.0152 9.8064 10.6527 0.5249 1.0720 6.8697 20.4053 3.1622 4.0859 146.4629 12.1799 0.4216 7.7503 8.6538 3.3643 14.3523 0.8265 0.2779 55.5309 6.9786 28.7856 28.9165 0.3060 2.5377 58.7892 5.9465 11.5348 87.6724 10.7072 6.9255 15.2451 10.2156 14.2230 42.5673 44.6138 20.7491 7.8801 0.9684 6.7242 0.0533 52.2508 9.2948 245.5902 34.9180 0.1063 75.7644 46.6556 32.9450 103.6399 69.6545 456.6830 4.9870 45.7490 15.7324 32.0776 3.4362 23.0750 9.4117 0.6189 6.5149 1.4772 9.4244 6.6391 34.1501 21.5205 116.0321 110.1905 2.8273 31.7454 13.4529 5.4887 8.4361 31.7805 2.6913 17.9459 1011.6022 0.2339 112.2874 489.6802 50.3761 26.1385 40.5038 81.3129 36.9521 18.2950 22.9327 5.1707 20.4999 39.9887 15.8577 54.9923 51.0313 38.4633 5.8546 1.5095 16.7633 253.1146 37.7790 4.7981
temp: 298.150 k
press: 1.00000 atm
elementType: 8 8 8 8 7 7 6 6 6 6 6 6 6 6 6 6 6 6 1 1 1 1 1 1 1 1 1 1 1 1 1 1 1 1 1 1 1 1
symmnumber: 1
zpe: 827005.3 jmol-1
zpe.correction: 0.314990 hartree
zpe.thermalcorrener: 0.334235 hartree
zpe.thermalcorrenthalpy: 0.335179 hartree
zpe.thermalcorrgfe: 0.264184 hartree
zpe.sumelectzpe: -878.269071 hartree
zpe.sumelectthermal: -878.249825 hartree
zpe.sumelectthermalent: -878.248881 hartree
zpe.sumelectthermalfe: -878.319877 hartree
dipole: 5.8141 -2.1277 1.1439
dipole: 6.2960
quadrupole: -93.7892 -114.0686 -107.1654
quadrupole: -16.7794 -6.8414 -1.8044
quadrupole: 11.2186 -9.0609 -2.1577 -16.7794 -6.8414 -1.8044
hfenergy: -878.5840605 hartree
pointgroup: C01 [X(C12H20N2O4)]
dipole: 2.2542697 -0.7269196 -0.724946 debye
polarizability: 236.3941229|-19.080683|116.3295914|-11.4778793|-0.8936699|156.7285141 unknown
InChI: InChI=1S/C12H20N2O4/c1-8(7-18-2)11(16)14-12(17)13-10-4-3-9(5-10)6-15/h7,9-10,13-15H,3-6H2,1-2H3
charge 0 multiplicity 1
38 atoms
O  -5.224176 2.855019 -1.457159
O  -0.936384 -0.409026 2.97756
O  1.326526 -0.738523 -0.576273
O  5.435625 -1.27801 -0.140622
N  -1.056886 -0.42724 0.623882
N  1.021581 -0.670711 1.74509
C  -4.278372 0.567237 -1.040066
C  -2.511063 -0.274474 0.529633
C  -2.954651 0.973382 -0.305264
C  -4.604062 -0.87019 -0.52528
C  -3.228349 -1.46722 -0.160374
C  -5.440486 1.548781 -0.812489
C  -0.406197 -0.490969 1.82835
C  1.826879 -0.792202 0.606723
C  3.276161 -0.985212 0.869829
C  3.83768 -1.060405 2.275966
C  4.068569 -1.093296 -0.242132
C  6.166281 -1.373515 -1.419006
H  -4.089463 0.526134 -2.130158
H  -2.882287 -0.184059 1.565911
H  -3.092772 1.847816 0.361065
H  -2.161871 1.240877 -1.027426
H  -5.237804 -0.811046 0.38356
H  -5.153679 -1.467843 -1.273319
H  -2.67664 -1.754943 -1.077444
H  -3.287166 -2.353847 0.494143
H  -6.367499 1.169988 -1.276404
H  -5.619361 1.672654 0.279364
H  -0.462958 -0.513448 -0.221811
H  -4.398967 3.258603 -1.08526
H  1.455644 -0.713547 2.669948
H  3.658154 -0.126416 2.844097
H  3.400267 -1.900434 2.850457
H  4.926752 -1.218382 2.238344
H  3.625591 -1.035291 -1.246735
H  7.221162 -1.514803 -1.144155
H  5.810398 -2.239203 -2.007249
H  6.050022 -0.442836 -2.004101
