program: Gaussian 09
title: 000271065
version: EM64L-G09RevD.01
frameworkgroup: C1[X(C12H20O)]
method: RPBEPBE
basis: SDD
operation: Freq
keyword: #pfreq=noraman
keyword: PBEPBE/SDD
title: #p freq=noraman PBEPBE/SDD
converged: YES YES NO NO
title: Mulliken charges:
elementType: O C C C C C C C C C C C C H H H H H H H H H H H H H H H H H H H H
charge: -0.264089 -0.182019 0.290270 -0.432003 -0.483716 -0.576033 -0.398324 -0.513917 -0.395989 0.079369 -0.222261 -0.388817 -0.680089 0.214964 0.202754 0.192086 0.207276 0.214527 0.206813 0.240108 0.191005 0.202378 0.214646 0.222109 0.198586 0.201760 0.191080 0.194217 0.215469 0.215396 0.208820 0.224987 0.208636
chargesum: 0.00000
title: Mulliken charges with hydrogens summed into heavy atoms:
elementType: O C C C C C C C C C C C C
charge: -0.264089 0.032945 0.290270 -0.037164 -0.061913 -0.129112 -0.004940 -0.077162 0.004357 0.079369 0.163036 0.042048 -0.037646
polarizability: 1.71483723e+02 6.42493781e+00 1.25711705e+02 9.88176461e-01 1.34882277e+00 9.84656622e+01
1716.lowfreq: -12.4150 -2.3493 -0.0002 0.0005 0.0007 14.1386 29.7523 59.7199 79.9429
frequency: 27.8317 59.5780 79.9308 89.7661 118.1199 147.0035 174.7620 203.3922 225.9805 257.1912 300.4586 313.8526 356.3467 407.8018 439.4382 462.4923 488.7440 564.8978 606.9433 622.4969 697.3292 765.4009 795.0094 835.2122 851.7715 862.0764 888.4257 891.7593 902.7544 932.1727 940.5265 974.2121 985.3395 1023.5819 1051.0510 1054.0919 1060.8681 1082.4123 1100.1874 1116.8445 1132.1470 1138.0669 1142.0876 1161.0882 1188.1842 1211.6233 1226.4761 1236.5535 1238.9529 1259.3990 1272.6250 1282.0953 1294.0385 1298.7582 1307.2372 1320.0134 1328.9987 1334.8951 1340.9575 1343.4163 1377.5346 1392.6711 1457.2538 1459.0588 1463.2632 1466.3196 1472.1469 1472.4220 1476.7357 1480.1345 1480.7370 1490.5434 1702.2894 2907.8497 2937.7285 2941.6352 2958.7627 2959.9677 2962.0694 2972.3271 2976.3403 2993.8066 2999.0532 3002.1582 3020.5424 3021.6804 3026.0956 3035.1534 3043.4477 3049.6211 3064.7644 3078.3901 3081.3132
redmass: 3.0006 1.7841 2.9055 2.8970 2.5226 2.4610 2.2651 2.9201 1.1676 2.7238 2.9185 1.8245 2.8713 3.7217 3.2414 3.1257 2.4035 2.7295 4.4461 2.8781 3.1078 1.0769 1.6768 1.6499 1.9727 2.3989 1.5049 1.3304 1.4750 2.6541 2.7586 2.2310 1.7755 4.2710 2.5089 2.7323 1.5594 1.6548 1.7309 1.4167 2.1968 1.4249 1.6741 1.6101 2.1634 1.5410 1.2863 1.4282 1.3374 1.3626 1.3022 1.1165 1.3589 1.8282 1.3436 1.4009 1.5389 1.5832 1.5213 1.8342 1.4540 1.2164 1.0863 1.0895 1.0886 1.0832 1.0865 1.0706 1.0966 1.0483 1.0631 1.0844 9.1884 1.0818 1.0681 1.0554 1.0639 1.0589 1.0646 1.0614 1.0361 1.0661 1.1051 1.0606 1.0953 1.0954 1.0999 1.0982 1.0974 1.1014 1.1027 1.1029 1.0988
irintensity: 1.5574 0.0354 0.3132 0.0986 4.3108 1.0331 1.9694 1.3579 0.1895 1.5591 2.9154 1.1222 0.4359 0.2966 0.3734 1.0820 1.5268 1.5499 7.1000 6.2537 5.2041 6.7191 1.5103 20.0068 0.9949 5.0063 1.0882 1.4877 9.9219 2.9991 9.2255 9.0641 7.4678 96.2616 8.0104 4.0773 0.7071 4.9893 8.3710 3.0938 17.0239 0.7831 10.7938 20.0230 78.3738 92.8581 4.2683 16.0297 2.2204 7.9144 7.9072 1.1018 13.6698 18.6566 1.3179 9.5194 0.1684 4.6899 3.9440 36.8454 2.8756 20.7987 6.8232 1.8075 7.7518 12.8325 12.5328 3.1633 4.9979 10.6738 2.8060 18.4103 72.6459 42.3305 49.4949 32.9955 69.2692 46.2120 30.8231 39.1660 41.4571 40.2103 33.7628 23.1028 73.1350 50.4041 58.0015 54.9844 53.2303 0.2346 60.8214 88.7478 44.3623
temp: 298.150 k
press: 1.00000 atm
elementType: 8 6 6 6 6 6 6 6 6 6 6 6 6 1 1 1 1 1 1 1 1 1 1 1 1 1 1 1 1 1 1 1 1
symmnumber: 1
zpe: 771827.5 jmol-1
zpe.correction: 0.293974 hartree
zpe.thermalcorrener: 0.307628 hartree
zpe.thermalcorrenthalpy: 0.308572 hartree
zpe.thermalcorrgfe: 0.252895 hartree
zpe.sumelectzpe: -543.442931 hartree
zpe.sumelectthermal: -543.429277 hartree
zpe.sumelectthermalent: -543.428333 hartree
zpe.sumelectthermalfe: -543.484010 hartree
dipole: 0.8548 1.1319 0.7001
dipole: 1.5818
quadrupole: -74.2078 -79.4422 -80.9966
quadrupole: 1.3154 1.8753 -0.7923
quadrupole: 4.0077 -1.2267 -2.7811 1.3154 1.8753 -0.7923
hfenergy: -543.7369048 hartree
pointgroup: C01 [X(C12H20O1)]
dipole: 0.3033001 -0.3640756 -0.4034078 debye
polarizability: 170.5194518|-7.7344607|123.4336485|-5.2538163|8.9895721|101.7079901 unknown
InChI: InChI=1S/C12H20O/c1-2-9-13-12-8-7-10-5-3-4-6-11(10)12/h10H,2-9H2,1H3
charge 0 multiplicity 1
33 atoms
O  1.56009 0.283402 0.362993
C  -1.996481 -0.786935 0.035328
C  -0.873058 0.197046 0.348595
C  -3.175406 -0.082841 -0.682289
C  -1.283759 -1.901587 -0.796999
C  -1.191632 1.552266 0.926611
C  -3.587494 1.209169 0.067954
C  0.236406 -1.783971 -0.46391
C  -2.39861 2.196111 0.186352
C  0.339774 -0.355718 0.069418
C  2.739655 -0.132088 -0.422992
C  3.922957 0.712692 0.057424
C  5.225821 0.353999 -0.690405
H  -2.390854 -1.215366 0.985641
H  -4.039348 -0.770863 -0.774299
H  -2.858933 0.18593 -1.711765
H  -1.438471 -1.696045 -1.873541
H  -1.680987 -2.910942 -0.589995
H  -1.459231 1.447682 2.001185
H  -0.303403 2.208711 0.884568
H  -3.946598 0.945522 1.085288
H  -4.434921 1.69667 -0.452702
H  0.869204 -1.969685 -1.352445
H  0.547359 -2.515215 0.311616
H  -2.715723 3.114803 0.717548
H  -2.081918 2.500707 -0.831745
H  2.549154 0.036907 -1.504394
H  2.940799 -1.212417 -0.265306
H  3.678095 1.781441 -0.087768
H  4.048982 0.558522 1.145493
H  5.12461 0.521447 -1.779462
H  6.067254 0.973465 -0.332723
H  5.500163 -0.706821 -0.536275
