program: Gaussian 09
title: 000271060
version: EM64L-G09RevD.01
frameworkgroup: C1[X(C10H11N7O3S)]
method: RPBEPBE
basis: SDD
operation: Freq
keyword: #p
keyword: freq=noraman
keyword: PBEPBE/SDD
title: #p freq=noraman PBEPBE/SDD
converged: NO YES NO NO
title: Mulliken charges:
elementType: S O O O N N N N N N N C C C C C C C C C C H H H H H H H H H H H
charge: 1.000473 -0.549221 -0.502334 -0.542466 -0.231217 -0.088514 -0.110056 -0.111643 -0.625020 -0.608018 -0.575013 -0.232990 0.312042 -0.237279 -0.285985 -0.235353 -0.193384 -0.083144 0.186335 0.170663 0.011169 0.295796 0.259720 0.245428 0.234162 0.377919 0.323540 0.444981 0.330770 0.346212 0.335922 0.336507
chargesum: 0.00000
title: Mulliken charges with hydrogens summed into heavy atoms:
elementType: S O O O N N N N N N N C C C C C C C C C C
charge: 1.000473 -0.171302 -0.502334 -0.542466 -0.231217 -0.088514 -0.110056 -0.111643 0.143500 0.068964 0.097417 -0.232990 0.312042 0.058517 -0.026265 0.010075 0.040778 -0.083144 0.186335 0.170663 0.011169
polarizability: 4.24899932e+02 -3.70538576e+01 2.24243878e+02 7.48745537e+00 7.79168509e+00 9.76863403e+01
1716.lowfreq: -124.3155 -3.5269 -1.9454 -0.0015 0.0013 0.0017 4.6151 31.8036 41.5490
frequency: -124.3097 31.7946 41.5460 77.4276 80.2256 101.9792 104.0241 136.7617 175.5640 186.2094 201.0326 206.1963 211.9200 247.0945 251.7823 270.0599 307.3945 313.9572 319.9258 333.8604 354.8337 390.9818 426.2322 460.1805 483.0454 507.7638 510.1258 524.9050 533.8783 541.7182 558.8110 564.0741 577.6292 607.4498 625.6320 639.5893 657.7455 667.6889 691.4096 722.0836 730.2555 769.4421 795.6073 799.7722 824.7727 865.2081 883.5336 911.3801 920.3910 935.5881 953.8475 965.0662 983.8985 994.4915 1027.1491 1076.2595 1106.7700 1131.1281 1135.2693 1152.0231 1167.2952 1196.4608 1252.2351 1281.5362 1350.0303 1375.4529 1383.5629 1427.9770 1433.3407 1440.0822 1455.4498 1490.2691 1505.2264 1545.6170 1552.3015 1579.2909 1595.3993 1600.5781 1625.6398 3138.5554 3156.7532 3168.6647 3177.5204 3289.3807 3485.5582 3520.8808 3552.7429 3595.9123 3685.4447 3712.6889
redmass: 1.3065 5.7958 7.3512 7.1712 6.6629 5.0782 5.6747 6.6476 5.7289 7.4289 5.8405 7.6814 6.9884 5.8857 7.3919 8.6144 3.7480 3.1422 4.0425 7.2767 5.2900 4.4088 12.0589 4.1137 4.3174 4.7995 1.3411 6.9299 1.7897 2.1621 7.1497 1.0677 4.4394 6.2752 1.0739 6.2586 1.8889 6.5223 2.5695 6.9513 4.1499 1.3226 9.9979 6.7521 13.2637 3.6260 1.7845 2.4651 1.1623 5.4641 1.8592 1.3912 5.8007 1.3583 1.9963 1.3051 1.9182 1.8026 2.3582 3.2061 1.1111 3.0241 1.7829 5.6165 8.2961 5.4332 6.4854 2.6704 3.6786 3.4422 3.0043 1.7845 2.1806 2.6165 5.8631 2.5833 1.8594 7.1433 2.3011 1.0871 1.0895 1.0936 1.0998 1.0630 1.0662 1.0443 1.0443 1.0900 1.1049 1.1059
irintensity: 148.7060 0.6026 3.3302 4.4744 2.9511 2.0835 0.9369 5.8102 1.4550 3.0240 12.7561 0.6091 3.9003 7.8720 7.7982 0.8411 9.6164 13.2604 7.5116 1.4370 5.0794 7.0950 90.9820 7.6132 3.2998 3.5908 170.8583 2.0267 255.2826 27.7244 102.0806 6.8161 1.8106 0.7965 38.9953 5.9042 139.4358 13.3516 41.1832 1.4942 1.0174 90.9410 22.8686 8.3484 66.3158 3.4116 1.5960 37.2902 144.0753 83.3778 12.1965 4.8201 15.7142 0.6565 6.2213 40.2998 26.2200 9.1413 17.5008 2.4371 6.9023 19.4631 70.6096 238.1869 403.4038 8.6865 551.7929 50.4700 84.3353 50.4091 7.0460 133.7708 79.5172 486.2355 1.9832 785.1399 892.9255 7.3077 97.3347 9.2902 7.0759 0.1975 21.2354 175.8684 33.3905 58.4651 259.1910 83.3449 74.5987 51.9675
temp: 298.150 k
press: 1.00000 atm
elementType: 16 8 8 8 7 7 7 7 7 7 7 6 6 6 6 6 6 6 6 6 6 1 1 1 1 1 1 1 1 1 1 1
symmnumber: 1
zpe: 588253.1 jmol-1
zpe.correction: 0.224054 hartree
zpe.thermalcorrener: 0.243233 hartree
zpe.thermalcorrenthalpy: 0.244177 hartree
zpe.thermalcorrgfe: 0.176816 hartree
zpe.sumelectzpe: -1392.984139 hartree
zpe.sumelectthermal: -1392.964960 hartree
zpe.sumelectthermalent: -1392.964016 hartree
zpe.sumelectthermalfe: -1393.031377 hartree
dipole: 5.0068 4.9499 -0.0348
dipole: 7.0407
quadrupole: -109.0457 -114.7949 -136.2355
quadrupole: -20.3024 4.7609 -0.0262
quadrupole: 10.9797 5.2305 -16.2102 -20.3024 4.7609 -0.0262
hfenergy: -1393.208193 hartree
pointgroup: C01 [X(C10H11N7O3S1)]
dipole: 1.7217001 -0.8334544 -2.0035288 debye
polarizability: 424.2552099|47.6078483|123.2362785|-9.1447201|43.1947904|199.3386622 unknown
InChI: InChI=1S/C10H11N7O3S/c11-8-7(9(12)15-10(13)14-8)17-16-5-3-1-2-4-6(5)21(18,19)20/h1-4,18H,11-13H2
charge 0 multiplicity 1
32 atoms
S  -2.624172 0.67503 1.950266
O  -2.151768 2.257272 1.104818
O  -4.062328 0.904935 2.641672
O  -1.367356 0.256543 2.894282
N  -0.501429 -0.336578 0.029927
N  0.447043 -0.463715 -0.896961
N  3.561738 0.444592 1.018128
N  4.053425 0.024881 -1.362871
N  1.393426 0.278043 1.862314
N  2.34171 -0.536818 -2.852299
N  5.720393 0.593808 0.159297
C  -2.891676 -0.418168 0.442734
C  -1.785435 -0.766541 -0.374697
C  -4.216568 -0.8020 0.190806
C  -2.075747 -1.578751 -1.511509
C  -4.469846 -1.604663 -0.943682
C  -3.394694 -1.984239 -1.786756
C  1.73276 -0.159141 -0.527898
C  2.233068 0.196699 0.79856
C  2.737125 -0.222534 -1.584056
C  4.391881 0.345675 -0.065134
H  -5.016738 -0.477849 0.863511
H  -1.240586 -1.881051 -2.149831
H  -5.491251 -1.929332 -1.163641
H  -3.59318 -2.609655 -2.664319
H  -1.268998 2.51844 1.498224
H  1.800154 0.485379 2.775568
H  0.381729 0.088919 1.753325
H  3.037359 -0.581728 -3.593264
H  1.351545 -0.711708 -3.020807
H  6.373587 0.532294 -0.617535
H  6.027233 0.834364 1.098528
