program: Gaussian 09
title: 000271057
version: EM64L-G09RevD.01
frameworkgroup: C1[X(C13H15N7O)]
method: RPBEPBE
basis: SDD
operation: Freq
keyword: #p
keyword: freq=noraman
keyword: PBEPBE/SDD
title: #p freq=noraman PBEPBE/SDD
converged: YES YES NO NO
title: Mulliken charges:
elementType: O N N N N N N N C C C C C C C C C C C C C H H H H H H H H H H H H H H H
charge: -0.229020 -0.252419 -0.082043 -0.104540 -0.113800 -0.613902 -0.608677 -0.577254 0.305648 -0.481183 0.120291 -0.328616 -0.340600 0.253043 -0.339185 -0.379668 -0.685997 -0.084202 0.184055 0.171590 0.011021 0.229803 0.229859 0.241158 0.277204 0.246541 0.238985 0.230696 0.207014 0.230653 0.317948 0.384212 0.328753 0.344499 0.334090 0.334041
chargesum: 0.00000
title: Mulliken charges with hydrogens summed into heavy atoms:
elementType: O N N N N N N N C C C C C C C C C C C C C
charge: -0.229020 -0.252419 -0.082043 -0.104540 -0.113800 0.088258 0.064576 0.090877 0.305648 -0.021520 0.120291 -0.087458 -0.063395 0.253043 -0.092644 -0.140682 -0.017634 -0.084202 0.184055 0.171590 0.011021
polarizability: 5.42521208e+02 1.61879419e+01 2.03908023e+02 3.88402986e-01 3.17405815e-02 8.58001926e+01
1716.lowfreq: -10.7010 -4.1007 -2.2252 -0.0012 -0.0006 0.0008 11.3498 30.0663 46.0726
frequency: 9.4603 30.0614 46.0723 50.0726 73.4774 89.2609 130.8870 141.5866 176.0911 191.3988 201.8625 206.7857 229.4147 243.9660 293.3290 312.7824 328.4251 338.7917 371.4298 387.5756 409.1499 445.4457 480.8677 493.1115 502.4134 520.6579 524.4689 533.2853 553.9954 573.2357 575.5672 611.5225 623.9613 625.8358 630.8495 654.0073 678.7508 721.6182 726.1958 739.5660 792.8137 799.6992 805.9120 839.9568 866.5632 884.3856 910.8698 922.9135 947.8012 974.2989 976.4235 998.4034 999.2943 1017.0703 1067.5064 1089.0759 1109.3638 1125.1382 1142.8000 1168.6015 1182.0907 1201.7884 1226.2957 1247.0563 1269.7504 1296.0428 1330.5314 1340.7012 1368.5568 1381.4955 1395.6650 1426.1273 1427.3486 1440.0186 1447.8050 1468.5035 1477.7838 1481.9965 1490.3346 1503.9894 1549.1733 1557.4138 1580.1768 1589.2416 1593.7769 1612.7768 1622.5694 2967.2362 2996.8953 3013.8186 3092.4154 3101.4008 3116.8271 3140.3716 3142.3338 3164.0963 3173.4381 3522.9590 3555.0228 3599.8987 3688.3254 3715.5250
redmass: 4.3909 5.1090 4.3825 5.3119 5.6907 1.8149 4.3407 5.3180 6.5332 1.3719 4.1115 7.4176 4.3854 5.6018 4.1631 2.8898 3.1141 6.1749 4.7771 3.9132 2.9545 6.6637 4.2687 1.2405 2.8215 6.7771 1.2484 7.4911 1.0561 2.0983 4.1240 1.3694 5.6192 1.0757 7.1047 5.2834 6.7748 9.7211 4.3306 2.9734 5.9543 7.4968 1.6603 1.2889 1.5743 7.6096 1.1163 2.7630 4.4605 2.0191 1.3624 2.5721 1.3518 1.5585 1.6587 2.7216 1.3766 2.0616 2.5229 1.5600 2.1306 3.5290 2.6749 1.1855 4.8562 1.3482 2.0509 8.7158 5.7412 6.0984 1.2141 3.6637 2.8345 1.1221 4.6372 1.0392 1.0555 2.1797 2.4806 2.1031 6.9114 2.3806 3.0045 4.3604 2.1448 6.0587 2.2876 1.0599 1.0365 1.0981 1.1001 1.0998 1.0687 1.0883 1.0878 1.0962 1.0943 1.0441 1.0442 1.0866 1.1049 1.1059
irintensity: 1.0281 0.0586 0.3832 0.7092 2.9517 0.9743 0.9366 1.7025 0.0682 0.5822 19.5489 0.2512 2.4284 0.0914 13.6615 8.2673 9.5733 2.5142 3.6526 12.4031 0.0745 28.8041 4.0475 170.8896 69.0874 0.4654 162.3287 0.9712 8.5951 11.3590 7.1146 251.6143 0.6554 53.8910 1.3845 1.7316 0.8321 7.6196 0.8561 2.6273 44.9186 5.3713 19.9466 1.0782 17.1702 5.6640 123.3831 20.4949 87.7800 15.4445 1.4359 0.1975 0.0016 30.5817 1.5675 1.9416 13.0198 61.2257 20.7518 54.6350 82.6584 4.2186 483.1317 0.2125 205.7164 23.0708 266.9836 516.4909 140.1286 105.8369 30.7258 10.4682 84.8277 18.4853 66.5252 11.5397 17.3242 34.9658 86.4902 123.8726 224.8439 862.2518 553.9939 331.6933 798.4222 20.3153 130.9283 45.2038 42.6824 11.2263 29.0030 31.7947 90.0294 18.0066 1.0206 8.3017 5.6336 51.1189 279.5648 85.3827 75.8594 50.6965
temp: 298.150 k
press: 1.00000 atm
elementType: 8 7 7 7 7 7 7 7 6 6 6 6 6 6 6 6 6 6 6 6 6 1 1 1 1 1 1 1 1 1 1 1 1 1 1 1
symmnumber: 1
zpe: 732208.5 jmol-1
zpe.correction: 0.278883 hartree
zpe.thermalcorrener: 0.298283 hartree
zpe.thermalcorrenthalpy: 0.299227 hartree
zpe.thermalcorrgfe: 0.229075 hartree
zpe.sumelectzpe: -961.387868 hartree
zpe.sumelectthermal: -961.368468 hartree
zpe.sumelectthermalent: -961.367524 hartree
zpe.sumelectthermalfe: -961.437677 hartree
dipole: 4.8827 3.0049 0.0359
dipole: 5.7334
quadrupole: -116.0512 -105.5466 -127.7568
quadrupole: -14.2008 -0.1349 -0.0920
quadrupole: 0.4003 10.9049 -11.3052 -14.2008 -0.1349 -0.0920
hfenergy: -961.6667515 hartree
pointgroup: C01 [X(C13H15N7O1)]
dipole: 1.8776022 -0.3212855 1.2081197 debye
polarizability: 540.3840508|-21.9538883|91.2481452|23.9493367|-23.4769753|200.5972274 unknown
InChI: InChI=1S/C13H15N7O/c1-2-9(21)7-3-5-8(6-4-7)19-20-10-11(14)17-13(16)18-12(10)15/h3-6H,2,14-16H2,1H3
charge 0 multiplicity 1
36 atoms
O  -5.884634 0.667669 -1.505005
N  0.534562 0.289156 -0.862347
N  1.257742 0.050863 0.234343
N  4.781162 0.164318 -1.105186
N  4.754368 -0.293531 1.319417
N  2.767161 0.468341 -2.278002
N  2.733917 -0.43281 2.490942
N  6.742054 -0.147054 0.114541
C  -3.721874 0.37383 -0.489801
C  -5.933794 0.168496 0.882651
C  -5.220782 0.422151 -0.452438
C  -2.927413 0.105325 0.66255
C  -3.062631 0.605282 -1.729882
C  -0.873399 0.301637 -0.66126
C  -1.52654 0.068645 0.58455
C  -1.663359 0.56965 -1.816352
C  -7.466039 0.243693 0.774292
C  2.628158 0.021861 0.103869
C  3.415309 0.220132 -1.107697
C  3.395768 -0.23702 1.312362
C  5.371928 -0.089346 0.105081
H  -5.620343 -0.824846 1.264873
H  -5.561339 0.904927 1.624362
H  -3.408808 -0.077095 1.629261
H  -3.68171 0.810624 -2.609355
H  -0.917866 -0.137899 1.4689
H  -1.151928 0.746828 -2.768485
H  -7.84588 -0.496989 0.050171
H  -7.935041 0.052146 1.756141
H  -7.7870 1.236904 0.416859
H  3.317783 0.60624 -3.125242
H  1.724966 0.498067 -2.212906
H  3.267209 -0.613696 3.337917
H  1.715442 -0.390509 2.483337
H  7.222865 -0.332653 0.990814
H  7.249286 -0.002936 -0.754679
