program: Gaussian 09
title: 000271041
version: EM64L-G09RevD.01
frameworkgroup: C1[X(C22H20N10O2S)]
method: RPBEPBE
basis: SDD
operation: Freq
keyword: #p
keyword: freq=noraman
keyword: PBEPBE/SDD
title: #p freq=noraman PBEPBE/SDD
converged: YES YES NO NO
title: Mulliken charges:
elementType: S O O N N N N N N N N N N C C C C C C C C C C C C C C C C C C C C C C H H H H H H H H H H H H H H H H H H H H
charge: 0.989278 -0.539575 -0.486404 -0.615117 -0.248980 -0.083274 -0.048946 -0.066819 -0.056943 -0.143468 -0.604373 -0.599502 -0.128370 -0.073621 -0.147126 -0.229554 0.274574 -0.321983 -0.353796 0.076882 0.077691 0.248535 -0.315948 0.077264 0.081626 0.077696 -0.287664 -0.251592 -0.769018 0.179886 -0.292024 -0.342037 -0.199949 -0.202564 -0.237950 0.289479 0.290028 0.363940 0.284533 0.248321 0.298912 0.238955 0.244165 0.257123 0.233102 0.235888 0.388183 0.319004 0.348179 0.328625 0.249195 0.252839 0.227887 0.232642 0.232167
chargesum: 0.00000
title: Mulliken charges with hydrogens summed into heavy atoms:
elementType: S O O N N N N N N N N N N C C C C C C C C C C C C C C C C C C C C C C
charge: 0.989278 -0.539575 -0.486404 -0.251177 -0.248980 -0.083274 -0.048946 -0.066819 -0.056943 -0.143468 0.102814 0.077301 -0.128370 -0.073621 0.142353 0.060474 0.274574 -0.037451 -0.105475 0.076882 0.077691 0.248535 -0.017036 0.077264 0.081626 0.077696 -0.048710 -0.007427 -0.042906 0.179886 -0.042829 -0.089198 0.027938 0.030078 -0.005782
polarizability: 8.71298589e+02 1.18050447e+02 4.80749323e+02 1.30031751e+01 -4.30276525e+01 2.13712077e+02
1716.lowfreq: -12.7015 -6.1493 -1.5377 0.0012 0.0014 0.0019 0.8063 7.0489 12.9467
frequency: -10.8939 4.8529 12.8377 15.8538 25.0280 29.3957 36.5258 47.4666 58.4959 67.8369 71.2461 83.7781 100.9748 121.5485 128.4483 144.3829 175.4488 177.8031 187.6723 197.5948 207.8571 217.0142 237.6789 239.8745 246.2460 259.5727 272.7174 302.5307 321.1645 339.7049 351.0718 357.9062 363.1189 406.1868 409.6216 413.9388 432.4522 441.6317 442.7160 449.4578 455.4770 482.0811 501.9074 521.0171 528.8854 531.2450 540.5807 547.4664 576.5413 598.1604 606.3133 610.3841 618.7401 620.1029 629.4976 637.9321 657.3481 671.8167 690.3461 696.8519 727.0851 728.6232 738.7994 768.8090 772.1495 777.6573 786.0952 790.4351 812.9048 831.5059 831.5742 835.1041 847.9859 856.8138 884.1577 909.6657 919.5038 920.3561 935.3442 953.2367 953.4139 961.1276 973.6049 975.5285 983.0162 984.3782 985.1058 986.5169 997.7340 1003.4203 1013.6530 1014.5509 1043.1109 1047.0715 1074.8534 1093.7000 1104.6930 1112.7179 1148.5598 1157.9404 1170.4349 1177.9662 1193.6133 1206.5985 1220.5090 1248.2360 1260.6347 1262.3371 1284.6195 1289.3812 1303.6185 1308.3134 1316.6683 1346.2000 1370.6949 1388.7488 1389.8895 1390.9189 1404.9380 1406.2646 1416.0662 1429.9391 1442.4503 1448.4221 1457.5036 1459.6800 1464.8973 1467.2221 1494.9400 1497.6836 1534.7376 1549.4078 1552.5181 1575.7031 1580.3041 1589.5545 1595.1973 1601.0535 1607.3877 2989.1969 3068.8831 3089.9125 3122.9097 3128.7933 3139.5162 3140.5488 3152.5339 3154.0109 3165.3757 3170.3606 3171.7283 3172.5434 3175.3071 3177.1095 3187.2377 3501.6341 3507.1552 3591.5328 3673.6716
redmass: 2.3506 3.3506 2.9652 2.3966 4.5608 5.6497 4.7573 5.3965 4.6049 6.5531 6.0256 6.7171 6.3215 6.6715 7.7230 8.5643 6.7902 7.0351 7.2025 4.6063 7.5471 9.5184 7.1974 4.5856 7.1041 7.8744 6.5449 7.1086 5.3308 3.1199 7.1120 7.1840 3.8567 2.8960 4.5538 3.7293 5.2003 3.9748 3.7809 2.8468 6.0169 8.3198 7.2565 2.4776 1.7159 3.8094 2.9363 6.8592 1.6733 4.9116 3.6888 6.7767 6.3446 8.0065 7.1135 1.3294 1.0897 6.1686 1.8360 3.0164 4.5827 6.3186 5.3657 7.3611 5.7527 2.6068 2.9983 6.0588 13.9803 1.3068 4.3556 1.2596 1.2495 1.5985 6.0132 4.5155 3.9910 1.1131 1.4429 8.9320 1.4508 3.1940 1.4107 1.3662 1.3886 4.6209 5.7879 1.3928 1.3242 1.8535 2.1167 2.0821 2.4707 1.6042 1.5505 1.5706 1.9293 1.7788 1.7066 1.2744 1.0597 1.7908 2.1781 2.3709 2.6080 3.1779 2.4703 3.1535 2.8126 1.3217 1.5551 5.1575 1.9308 8.5840 4.5207 6.7548 6.3776 1.3283 4.9253 3.7688 2.3066 3.8874 2.3713 2.8483 2.1823 1.2661 2.2690 1.0461 4.9760 2.0462 5.1895 5.1379 1.8307 6.6083 6.0504 5.9704 3.9511 5.7110 3.4998 1.0382 1.0971 1.0693 1.0986 1.0852 1.0886 1.0905 1.0883 1.0927 1.0953 1.0881 1.0970 1.1003 1.0918 1.0971 1.0969 1.0452 1.0773 1.0861 1.1040
irintensity: 0.4239 0.2302 1.0021 0.2471 0.2105 0.0446 0.1294 1.8585 0.1824 3.3950 1.2028 0.7232 0.0430 3.4957 0.2365 1.6984 4.6703 1.7064 2.8190 1.2770 1.2824 2.5465 7.0364 11.0040 13.7426 6.9924 1.3276 29.6085 8.6206 22.3088 0.2193 0.5578 3.8457 0.0166 23.1196 14.1132 96.8210 3.5842 9.0838 63.1299 118.9229 108.3446 8.7159 56.3060 42.7399 14.0864 59.1454 32.0986 108.2086 45.7037 6.3755 4.5143 13.4164 1.0079 48.4011 127.6998 73.1520 15.4039 58.7766 281.8176 2.6523 4.0297 4.8867 6.1153 5.3852 86.4314 1.8658 3.4219 183.5419 41.3223 0.8804 0.5775 0.0183 39.0937 0.6751 2.4350 7.2968 108.0675 4.1078 60.0412 27.7610 15.3094 0.3886 3.5910 0.0834 2.0801 0.4239 0.7502 0.5350 7.2175 56.7332 10.1923 79.6473 10.0040 11.3449 8.2998 46.4575 15.1265 136.1411 18.8519 0.2252 3.8981 12.2847 13.0977 43.5394 121.1831 28.0807 41.1756 35.8536 0.1443 106.7486 903.5203 7.4292 108.8499 147.3984 3.1607 4.8396 80.9047 28.4505 23.0260 9.3205 551.0346 14.6807 10.8742 57.3799 99.7238 12.4840 16.9252 130.6163 37.2258 135.9412 305.8087 14.1025 81.6491 1.2677 38.5513 685.9543 22.0921 1015.6312 13.8346 14.0831 102.3379 8.7948 6.5671 8.1597 9.2564 4.3046 22.0886 20.9236 1.7860 4.5398 47.2619 1.0609 10.8078 1.0230 173.6318 100.6471 103.0715 84.7501
temp: 298.150 k
press: 1.00000 atm
elementType: 16 8 8 7 7 7 7 7 7 7 7 7 7 6 6 6 6 6 6 6 6 6 6 6 6 6 6 6 6 6 6 6 6 6 6 1 1 1 1 1 1 1 1 1 1 1 1 1 1 1 1 1 1 1 1
symmnumber: 1
zpe: 1056003.9 jmol-1
zpe.correction: 0.402211 hartree
zpe.thermalcorrener: 0.433158 hartree
zpe.thermalcorrenthalpy: 0.434102 hartree
zpe.thermalcorrgfe: 0.334336 hartree
zpe.sumelectzpe: -1943.699955 hartree
zpe.sumelectthermal: -1943.669008 hartree
zpe.sumelectthermalent: -1943.668064 hartree
zpe.sumelectthermalfe: -1943.767829 hartree
dipole: 6.9807 1.8899 5.3612
dipole: 9.0025
quadrupole: -187.1937 -171.9959 -220.8978
quadrupole: -23.5715 -22.8659 -8.1856
quadrupole: 6.1687 21.3666 -27.5353 -23.5715 -22.8659 -8.1856
hfenergy: -1944.1021653 hartree
pointgroup: C01 [X(C22H20N10O2S1)]
dipole: 2.8371366 2.1185974 -0.0827157 debye
polarizability: 887.9810816|14.1031351|205.8723417|-82.8314616|-8.8658158|471.9065655 unknown
InChI: InChI=1S/C22H20N10O2S/c1-14-11-12-25-22(26-14)32-35(33,34)17-9-7-16(8-10-17)29-31-19-13-18(20(23)27-21(19)24)30-28-15-5-3-2-4-6-15/h2-13,32H,23-24H2,1H3
charge 0 multiplicity 1
55 atoms
S  -5.684738 -1.813658 0.255815
O  -6.622396 -2.106746 1.552865
O  -5.619959 -2.851662 -0.983149
N  -6.373813 -0.174771 -0.277059
N  -0.098125 -0.70712 2.372441
N  -6.987207 1.376442 -1.905745
N  -4.881413 0.129978 -2.086496
N  0.911538 -0.752714 1.509098
N  3.83467 0.006067 3.807369
N  5.72748 -0.356458 0.64545
N  1.562761 -0.158703 4.341025
N  6.106786 0.172743 3.286669
N  5.508182 -0.632221 -0.621077
C  -3.946138 -1.425951 0.85095
C  -2.88417 -1.492425 -0.069181
C  -3.789678 -1.145926 2.218546
C  -1.377069 -0.959948 1.792082
C  -1.584918 -1.257019 0.412628
C  -2.482241 -0.909321 2.685909
C  -6.064656 0.453347 -1.47704
C  2.190925 -0.515507 2.010237
C  -6.690914 2.059423 -3.05193
C  3.251748 -0.567337 1.071549
C  4.580798 -0.340252 1.467741
C  2.548125 -0.217078 3.406303
C  4.824566 -0.051127 2.876615
C  -5.491435 1.787165 -3.766897
C  -4.623552 0.808251 -3.241605
C  -7.69085 3.088622 -3.523322
C  6.670967 -0.637443 -1.452044
C  7.997346 -0.337234 -1.024983
C  6.429166 -0.971901 -2.812532
C  9.054364 -0.376046 -1.952715
C  7.494228 -1.010128 -3.73572
C  8.810174 -0.712312 -3.309543
H  -3.085529 -1.710063 -1.121229
H  -4.655953 -1.136413 2.887021
H  -7.302357 -0.006518 0.13039
H  -0.718678 -1.295007 -0.252684
H  -2.298842 -0.687845 3.741961
H  3.028222 -0.786653 0.02353
H  -5.25161 2.314985 -4.693226
H  -3.686405 0.55111 -3.74711
H  -8.531519 3.145888 -2.815566
H  -7.222356 4.08664 -3.606304
H  -8.08391 2.827475 -4.523351
H  0.596599 -0.336132 3.981066
H  1.814214 0.047637 5.308192
H  6.84378 0.126907 2.581362
H  6.294655 0.374254 4.266304
H  8.172561 -0.077847 0.023374
H  5.400594 -1.19692 -3.113209
H  10.074661 -0.144126 -1.626571
H  7.30122 -1.270021 -4.782069
H  9.639601 -0.739982 -4.024835
