program: Gaussian 09
title: 000270998
version: EM64L-G09RevD.01
frameworkgroup: C1[X(C23H20N6O5S)]
method: RPBEPBE
basis: SDD
operation: Freq
keyword: #p
keyword: freq=noraman
keyword: PBEPBE/SDD
title: #p freq=noraman PBEPBE/SDD
converged: YES YES NO NO
title: Mulliken charges:
elementType: S O O O O O N N N N N N C C C C C C C C C C C C C C C C C C C C C C C H H H H H H H H H H H H H H H H H H H H
charge: 0.973841 -0.182555 -0.247405 -0.542423 -0.482278 -0.235342 -0.275338 0.045154 -0.023806 -0.080329 -0.641545 -0.074263 -0.446002 0.034948 0.186288 0.425546 -0.058653 0.220010 0.179533 -0.376948 -0.347662 -0.141995 -0.232334 -0.284739 -0.319473 -0.201570 -0.218843 -0.244231 0.291875 -0.255506 -0.324203 -0.665703 -0.145949 -0.316126 -0.192025 0.316011 0.285781 0.297469 0.294591 0.296428 0.289752 0.266471 0.341443 0.230303 0.230840 0.232095 0.230418 0.234682 0.232714 0.230925 0.220943 0.251761 0.242216 0.239583 0.235626
chargesum: 0.00000
title: Mulliken charges with hydrogens summed into heavy atoms:
elementType: S O O O O O N N N N N N C C C C C C C C C C C C C C C C C C C C C C C
charge: 0.973841 -0.182555 -0.247405 -0.542423 -0.482278 -0.235342 -0.275338 0.045154 -0.023806 -0.080329 -0.300102 -0.074263 -0.129991 0.034948 0.186288 0.425546 -0.058653 0.220010 0.179533 -0.091167 -0.050193 0.152596 0.064094 0.005013 -0.053002 0.028733 0.011997 -0.012136 0.291875 0.209594 -0.091489 0.037926 0.096267 -0.076543 0.043601
polarizability: 5.15452455e+02 -6.09375280e+01 3.12688956e+02 3.05766857e+01 1.95349295e+01 3.09824652e+02
1716.lowfreq: -4.7905 -2.4508 -0.0013 -0.0010 0.0014 2.2587 3.2792 11.6572 17.4463
frequency: -1.6104 11.5983 17.4347 20.5654 29.6387 32.7273 42.0482 46.5406 57.7562 68.2723 71.4866 79.8661 85.7625 88.9379 100.0085 102.7226 116.9581 162.3216 169.6733 182.7522 198.8617 199.8036 214.2560 222.1238 227.1533 248.1891 256.6516 280.4025 293.2825 309.7177 324.9830 339.9324 354.9568 358.9533 374.8339 404.0196 407.1591 407.4975 420.9446 437.4794 443.9507 451.4583 455.8896 491.4954 513.3274 514.3066 537.4972 574.2897 590.5647 598.9381 613.1785 613.9789 622.8932 649.3912 676.4485 692.7130 698.9895 705.8202 714.1660 736.3255 738.6269 748.7615 766.2395 771.2325 774.4872 810.1523 816.3881 822.1226 840.2017 848.1922 853.6447 856.1071 866.8452 868.7917 891.1499 933.8131 936.5513 949.7659 950.9194 959.3431 972.8076 984.1859 985.9802 986.4257 990.0211 990.4613 991.0735 1001.3026 1004.3719 1027.4880 1028.6439 1039.4540 1043.3530 1075.8751 1095.2448 1095.8809 1099.6549 1105.3420 1107.2535 1148.5177 1156.7780 1165.9327 1166.8119 1174.6618 1187.7725 1192.2957 1207.5662 1236.4763 1277.0913 1284.7494 1286.1845 1309.7913 1320.1611 1327.5823 1345.8224 1348.7159 1381.8995 1383.8551 1391.6234 1392.8957 1394.9439 1418.9743 1424.3877 1448.3900 1453.8302 1457.3822 1457.5021 1462.2212 1483.2225 1484.5512 1521.2717 1557.9175 1577.4617 1581.3650 1592.8934 1594.8830 1596.3374 1610.0275 1651.1625 2994.5834 3031.7415 3053.1104 3090.2985 3096.1993 3122.3405 3133.3757 3135.8308 3140.8682 3145.2650 3158.8095 3159.1029 3164.2506 3167.4799 3176.4019 3181.1725 3185.7473 3187.7594 3193.4475 3488.9378
redmass: 6.7535 6.2282 6.1025 5.0472 4.3952 4.1692 3.5294 5.4356 5.1330 6.8939 5.5708 6.5409 7.4871 4.3962 6.6549 6.8932 8.0488 7.6613 3.4946 6.6291 7.1837 3.4027 2.0817 8.0305 5.0505 8.0542 9.2282 5.6435 4.9061 4.8890 6.9506 6.9067 8.3444 6.9101 8.3737 3.4875 2.9602 3.4272 6.5951 5.1880 5.4028 1.5259 6.8122 7.0128 2.9129 3.4234 3.0709 6.0838 6.5935 6.6236 6.4798 7.0814 6.1628 7.8592 8.3283 6.7442 2.1186 3.1039 6.1377 3.6771 2.1091 6.9378 3.1878 1.6570 2.0797 11.8576 1.5402 4.3929 1.2972 5.9183 5.2629 1.2428 1.5616 1.3353 6.9411 5.9643 1.4246 6.9000 1.5636 7.5302 5.0443 1.3945 1.3344 6.0761 1.3656 4.0473 1.5021 1.3084 2.6909 2.6687 4.9876 2.2757 2.3901 2.7855 2.1409 1.6039 1.7226 3.0425 1.4944 1.6924 1.6651 1.0717 1.7333 1.0521 1.8267 1.1367 1.4122 1.5374 1.1317 3.4274 1.4361 2.0534 3.7888 1.3299 1.5153 2.0234 3.6208 9.4090 1.2961 3.2232 9.6662 2.2312 5.5171 2.3762 2.2937 1.1700 2.0142 1.0478 2.2919 1.0765 10.0314 5.7919 6.3424 5.9289 7.2249 8.6989 7.6653 5.9829 12.3905 1.0359 1.0601 1.0831 1.0976 1.1026 1.1064 1.0856 1.0883 1.0894 1.0910 1.0955 1.0888 1.0975 1.0888 1.0973 1.1006 1.0971 1.0948 1.0957 1.0776
irintensity: 0.7617 0.3719 0.6361 1.1328 0.5854 0.1782 0.1638 2.0279 0.2686 1.5321 0.6773 0.5905 1.0259 1.6889 2.4764 1.0750 0.8057 1.1902 0.3749 8.6091 5.4391 4.5941 2.2828 1.3815 5.4806 7.3548 6.3271 0.6503 6.3912 16.2464 7.6300 2.6178 20.9886 8.1901 34.2746 6.1078 0.3701 4.9925 25.5063 39.1553 65.6575 56.3633 6.9614 31.8272 22.1636 10.9203 33.4554 3.5051 23.9657 54.8418 0.1562 0.5071 5.2639 26.6032 18.0393 10.6832 40.7618 205.0550 1.3781 0.8798 60.2001 10.5887 13.9641 69.2285 61.1482 117.6536 9.0199 20.8605 8.2832 6.0022 39.0265 0.0642 48.2105 2.0927 6.0840 45.2712 8.3943 38.3895 11.0071 26.3042 19.2470 0.8403 0.2852 0.3434 0.0214 6.7743 0.2578 1.5164 26.9333 114.9661 280.5983 5.6378 33.2122 139.9936 23.8697 6.9458 48.0314 46.4664 7.2280 15.3221 17.5689 6.4677 175.0558 0.5339 24.7686 0.8669 13.4009 39.5705 6.5476 151.9955 20.2320 21.0004 74.0159 4.6089 36.1197 18.4082 82.9794 7.8207 24.3489 22.8921 13.5395 80.2261 11.1931 7.3867 124.4695 31.2501 15.6313 13.0606 154.2438 9.0160 102.1712 13.0586 33.8447 111.3463 64.9114 145.4095 20.0865 30.6932 245.6190 15.9896 34.3968 3.6311 39.2128 1.9917 27.0247 0.1726 13.2590 2.0652 19.8262 18.8004 3.3171 33.6030 3.9677 2.3033 19.9871 3.3784 1.8426 7.3346 47.4649
temp: 298.150 k
press: 1.00000 atm
elementType: 16 8 8 8 8 8 7 7 7 7 7 7 6 6 6 6 6 6 6 6 6 6 6 6 6 6 6 6 6 6 6 6 6 6 6 1 1 1 1 1 1 1 1 1 1 1 1 1 1 1 1 1 1 1 1
symmnumber: 1
zpe: 1045265.1 jmol-1
zpe.correction: 0.398120 hartree
zpe.thermalcorrener: 0.429781 hartree
zpe.thermalcorrenthalpy: 0.430725 hartree
zpe.thermalcorrgfe: 0.330437 hartree
zpe.sumelectzpe: -1988.404521 hartree
zpe.sumelectthermal: -1988.372860 hartree
zpe.sumelectthermalent: -1988.371916 hartree
zpe.sumelectthermalfe: -1988.472205 hartree
dipole: -0.1330 5.4870 -0.7433
dipole: 5.5387
quadrupole: -167.4812 -206.3975 -209.6233
quadrupole: -21.8305 25.7428 12.5581
quadrupole: 27.0194 -11.8968 -15.1227 -21.8305 25.7428 12.5581
hfenergy: -1988.8026416 hartree
pointgroup: C01 [X(C23H20N6O5S1)]
dipole: 0.0979476 -2.0555437 0.7166555 debye
polarizability: 520.3697785|-53.528578|289.388677|20.6638001|-18.4586247|328.2076072 unknown
InChI: InChI=1S/C23H20N6O5S/c1-2-34-23(31)21-20(22(30)29(27-21)17-8-4-3-5-9-17)26-25-16-11-13-18(14-12-16)35(32,33)28-19-10-6-7-15-24-19/h3-15,20,28H,2H2,1H3
charge 0 multiplicity 1
55 atoms
S  4.557946 2.208205 1.564524
O  -3.088434 0.548877 -3.072323
O  -3.403034 -3.007194 1.710907
O  4.375046 2.682804 3.111939
O  5.030499 3.250981 0.42052
O  -1.620153 -3.545936 0.288429
N  -4.313477 -0.086604 -1.110049
N  -4.196905 -1.050571 -0.079773
N  -0.929919 -0.65897 -1.248382
N  -0.720732 -0.383735 -0.000186
N  5.764623 0.806961 1.800059
N  5.844556 0.244412 -0.486044
C  -2.295914 -1.253314 -1.484971
C  -3.073031 -1.72201 -0.275475
C  -3.23803 -0.144166 -2.042905
C  -5.460105 0.777973 -1.107191
C  2.959108 1.358303 1.025016
C  -2.617592 -2.835938 0.583975
C  0.562889 0.216812 0.271145
C  -6.432165 0.621504 -0.085871
C  -5.61627 1.773977 -2.105494
C  2.733997 1.155058 -0.34813
C  2.046721 1.034311 2.040032
C  1.510741 0.574846 -0.728349
C  0.825007 0.449794 1.644409
C  -7.55949 1.466789 -0.068553
C  -6.753399 2.609562 -2.068501
C  -7.728745 2.464891 -1.056683
C  6.46622 0.234616 0.730404
C  -2.985548 -4.102964 2.644577
C  7.737641 -0.374308 0.944276
C  -1.90823 -3.603891 3.611019
C  8.358399 -1.014533 -0.144492
C  6.477878 -0.362273 -1.52877
C  7.725335 -1.012302 -1.411786
H  -2.148934 -2.038503 -2.246503
H  -6.292641 -0.149925 0.674535
H  -4.867492 1.889519 -2.891281
H  3.503203 1.431738 -1.073677
H  2.278627 1.251413 3.087019
H  1.271967 0.391792 -1.779816
H  0.062741 0.170685 2.378057
H  6.230431 0.937438 2.707949
H  -8.307725 1.343809 0.72203
H  -6.871605 3.378175 -2.839991
H  -8.607034 3.118721 -1.037484
H  -3.922012 -4.363041 3.16224
H  -2.626633 -4.958238 2.045498
H  8.213196 -0.347163 1.929966
H  -2.254442 -2.708947 4.155806
H  -1.681207 -4.39343 4.351158
H  -0.977835 -3.360741 3.071137
H  9.33167 -1.497696 -0.008737
H  5.954237 -0.3205 -2.490373
H  8.184953 -1.489172 -2.281537
