program: Gaussian 09
title: 000270997
version: EM64L-G09RevD.01
frameworkgroup: C1[X(C23H21N7O5S)]
method: RPBEPBE
basis: SDD
operation: Freq
keyword: #p
keyword: freq=noraman
keyword: PBEPBE/SDD
title: #p freq=noraman PBEPBE/SDD
converged: YES YES NO NO
title: Mulliken charges:
elementType: S O O O O O N N N N N N N C C C C C C C C C C C C C C C C C C C C C C C H H H H H H H H H H H H H H H H H H H H H
charge: 0.991069 -0.182521 -0.247270 -0.235450 -0.533595 -0.480473 -0.274969 0.045862 -0.022628 -0.079928 -0.617087 -0.081056 -0.052734 -0.446382 0.034129 0.186172 0.425773 -0.062160 0.219358 -0.376957 -0.347635 0.180047 -0.230967 -0.145560 -0.318978 -0.284487 -0.201432 -0.219237 -0.243923 0.079695 -0.255266 -0.665300 0.249015 -0.283649 -0.249007 -0.767886 0.315875 0.285771 0.297684 0.296499 0.295061 0.267598 0.290069 0.230514 0.231015 0.366878 0.232248 0.234438 0.230694 0.230972 0.251745 0.221230 0.241061 0.246314 0.237587 0.257655 0.234506
chargesum: 0.00000
title: Mulliken charges with hydrogens summed into heavy atoms:
elementType: S O O O O O N N N N N N N C C C C C C C C C C C C C C C C C C C C C C C
charge: 0.991069 -0.182521 -0.247270 -0.235450 -0.533595 -0.480473 -0.274969 0.045862 -0.022628 -0.079928 -0.250209 -0.081056 -0.052734 -0.130507 0.034129 0.186172 0.425773 -0.062160 0.219358 -0.091186 -0.049950 0.180047 0.065533 0.149501 -0.051380 0.005582 0.029082 0.011779 -0.011675 0.079695 0.209866 0.038648 0.249015 -0.042587 -0.002693 -0.038138
polarizability: 5.31781496e+02 -6.34911724e+01 3.19039317e+02 2.36754298e+01 1.61583039e+01 3.12197441e+02
1716.lowfreq: -45.9046 -2.6353 0.0009 0.0015 0.0017 2.1137 3.0604 6.7405 9.7251
frequency: -45.9007 6.1533 9.6356 15.1508 19.0364 26.6325 33.4412 33.5945 41.5092 57.6043 68.3273 69.8108 79.1937 83.9399 85.5591 98.9003 102.3165 114.5845 162.6583 169.2357 175.2371 187.8100 196.9127 198.5145 212.8738 216.5692 227.2599 246.1938 257.1272 280.2859 292.9381 309.5541 316.9179 333.6929 347.5546 360.2425 368.0831 377.6167 407.2038 407.3597 422.2869 438.7725 440.9177 446.6194 456.8219 493.3504 513.9519 527.7822 531.4709 538.3804 575.5606 597.7698 605.1540 613.3896 613.8302 630.6954 649.6889 676.6131 692.7929 698.9089 702.7939 713.9803 736.4556 748.6718 765.8985 771.2117 772.3426 790.4714 813.1167 815.6596 821.5320 834.0116 841.4005 848.0978 856.0643 866.3144 892.2622 911.3788 933.0586 936.5446 955.1658 961.0895 973.2688 975.5265 983.7432 986.5577 989.9388 990.6424 990.7825 1001.2657 1004.8168 1013.2390 1027.8571 1029.0330 1044.0505 1046.7687 1076.1705 1093.7486 1095.3930 1099.7085 1105.2144 1108.7974 1149.0269 1156.2345 1166.8557 1174.6907 1189.8037 1192.4545 1210.1790 1237.7201 1260.1020 1277.6831 1284.1158 1284.7405 1288.5066 1316.8153 1327.9545 1346.4772 1381.7844 1384.0351 1389.1092 1391.2433 1393.5354 1394.5842 1416.1055 1424.4528 1426.7805 1448.7415 1456.3250 1458.1465 1458.8391 1461.8811 1465.6168 1483.3419 1483.9378 1521.1698 1533.3132 1550.0760 1578.6047 1592.9665 1594.7772 1596.1107 1610.1630 1650.8999 2989.4440 2994.3024 3031.4894 3053.8149 3069.3771 3090.0379 3096.0197 3122.2228 3123.4665 3133.8488 3142.9821 3145.7309 3159.3277 3164.7086 3167.8911 3176.6188 3178.8551 3187.3320 3188.1111 3194.2334 3503.5306
redmass: 1.0227 6.3712 5.6234 5.9837 4.6008 4.4900 3.5336 3.7753 5.5618 5.2917 6.2547 6.1964 5.5062 5.6699 7.8237 6.7536 6.9739 7.8375 7.9387 3.3957 7.2219 5.8863 4.6437 3.2740 2.4545 5.9382 5.3923 7.8390 9.0750 5.6123 4.9356 5.0146 5.3475 6.0210 6.5934 7.0989 5.1059 7.3294 3.2444 3.0310 6.7414 4.3477 3.5785 6.2127 7.2072 7.3449 3.5355 1.5730 4.6799 3.1101 5.8600 6.0194 3.6826 6.6526 6.8984 7.0668 7.8416 8.0435 6.6479 2.1239 2.9496 6.1293 4.0935 7.1341 3.1136 1.6614 5.5512 6.2293 4.6531 1.9336 4.4846 1.2878 1.2912 5.7771 1.2430 1.5731 7.0883 4.4266 5.8570 1.4323 8.1857 3.4779 5.0765 1.4084 1.3927 6.1323 1.3634 1.8191 2.7605 1.3086 2.6998 2.1504 2.6151 5.2100 2.3973 1.6092 2.8039 1.5641 2.1562 1.7185 3.9100 1.3520 1.7564 1.6680 1.7199 1.0523 1.7575 1.1425 2.3682 1.5359 2.4611 1.1415 2.8781 4.4266 1.2930 1.9422 1.3283 1.5263 3.5002 9.4168 1.2671 1.2711 3.4609 8.9743 2.3997 5.1285 3.8760 2.3789 1.1131 1.8416 1.3895 1.0451 1.0470 1.9396 1.1768 10.0083 5.0602 5.5549 6.4596 7.4807 8.3583 7.6310 5.9817 12.3569 1.0382 1.0359 1.0601 1.0831 1.0970 1.0976 1.1026 1.1065 1.0987 1.0856 1.0906 1.0910 1.0888 1.0975 1.0890 1.0974 1.0972 1.0968 1.0949 1.0956 1.0773
irintensity: 0.3725 0.7930 0.4285 0.5088 1.3843 0.1984 0.2111 0.0289 0.4230 0.3424 1.2878 0.8283 0.3361 2.0065 1.1818 1.4986 1.3575 1.2651 1.2286 0.2529 8.6238 5.0862 1.4261 6.7216 2.8412 0.9429 7.0616 2.4001 6.4133 0.7029 5.6910 16.3390 13.8810 3.1921 7.2675 12.4473 6.2010 33.5034 6.4992 2.4207 30.9026 28.0516 13.3314 94.1212 10.9519 55.5225 13.1566 44.9381 9.1475 43.6838 8.8102 29.6100 5.8437 0.7402 0.5761 39.1522 26.7685 18.6900 9.3809 42.1834 260.4079 3.9993 6.5747 11.4332 15.0699 68.4463 3.6869 3.6163 98.9912 32.2194 21.3696 36.7766 4.5124 8.4033 0.0703 48.7503 5.7301 2.7227 47.8557 8.0902 61.8704 18.1233 19.0195 0.3757 0.6319 0.3102 0.0018 3.9325 3.6006 1.4566 29.6562 37.7872 102.4495 293.6912 35.1579 10.4884 142.6736 6.0062 24.3158 51.0738 49.1012 3.0274 15.0771 17.5425 174.6599 0.5646 23.0557 1.3024 5.8665 41.0627 28.3682 7.6381 50.0574 132.4403 2.1858 6.6743 4.5433 39.1659 81.7042 8.2005 84.3178 20.5506 29.3307 16.5538 0.5147 79.6037 496.4355 7.2807 26.0286 47.3439 63.3179 14.3798 17.3100 144.5061 16.9897 103.2663 154.6165 260.3083 4.3815 87.8537 120.4433 20.6326 30.4626 246.0337 11.7282 15.9349 34.0182 3.7301 13.0192 38.4538 2.1438 26.9588 8.1913 0.1865 10.3251 19.7087 3.3192 33.4786 3.3789 2.0426 11.0388 2.8240 1.9089 7.3589 88.4362
temp: 298.150 k
press: 1.00000 atm
elementType: 16 8 8 8 8 8 7 7 7 7 7 7 7 6 6 6 6 6 6 6 6 6 6 6 6 6 6 6 6 6 6 6 6 6 6 6 1 1 1 1 1 1 1 1 1 1 1 1 1 1 1 1 1 1 1 1 1
symmnumber: 1
zpe: 1085068.4 jmol-1
zpe.correction: 0.413281 hartree
zpe.thermalcorrener: 0.446767 hartree
zpe.thermalcorrenthalpy: 0.447711 hartree
zpe.thermalcorrgfe: 0.340640 hartree
zpe.sumelectzpe: -2043.678751 hartree
zpe.sumelectthermal: -2043.645265 hartree
zpe.sumelectthermalent: -2043.644321 hartree
zpe.sumelectthermalfe: -2043.751392 hartree
dipole: 0.6248 5.4781 -1.7188
dipole: 5.7753
quadrupole: -180.1824 -214.7155 -212.5475
quadrupole: -20.1174 34.9937 11.3784
quadrupole: 22.2994 -12.2337 -10.0657 -20.1174 34.9937 11.3784
hfenergy: -2044.0920315 hartree
pointgroup: C01 [X(C23H21N7O5S1)]
dipole: 0.1972853 2.2098868 0.4901437 debye
polarizability: 526.272296|-47.4492571|295.0355906|-53.3356029|19.7944091|341.7103668 unknown
InChI: InChI=1S/C23H21N7O5S/c1-3-35-22(32)20-19(21(31)30(28-20)17-7-5-4-6-8-17)27-26-16-9-11-18(12-10-16)36(33,34)29-23-24-14-13-15(2)25-23/h4-14,19,29H,3H2,1-2H3
charge 0 multiplicity 1
57 atoms
S  -3.946589 -2.648679 1.578309
O  3.139594 -0.028068 -3.463986
O  3.888112 2.784597 1.746599
O  1.948537 3.457046 0.615878
O  -3.585818 -3.392485 2.978556
O  -4.5515 -3.465772 0.321034
N  4.548259 0.343663 -1.557715
N  4.521221 1.136267 -0.385292
N  1.159008 0.823027 -1.274057
N  1.090956 0.337954 -0.075077
N  -5.119279 -1.349259 2.178623
N  -7.020237 -0.024845 1.923505
N  -5.454898 -0.346121 0.06276
C  2.483799 1.488782 -1.549494
C  3.372231 1.793103 -0.363922
C  3.382419 0.506607 -2.360571
C  5.703774 -0.473662 -1.801927
C  -2.428637 -1.67088 1.023092
C  2.988133 2.750401 0.69575
C  6.766287 -0.455998 -0.862157
C  5.779721 -1.286155 -2.962543
C  -0.146885 -0.340206 0.224811
C  -1.414393 -1.491776 1.975743
C  -2.359077 -1.233044 -0.311767
C  -0.252296 -0.80979 1.558057
C  -1.193984 -0.555773 -0.714335
C  7.904415 -1.255074 -1.090502
C  6.929296 -2.078201 -3.171007
C  7.994923 -2.069926 -2.243444
C  -5.895722 -0.55315 1.341677
C  3.555714 3.72222 2.868354
C  2.599792 3.056627 3.861554
C  -7.777469 0.814074 1.154127
C  -7.411913 1.08366 -0.194325
C  -6.243033 0.473184 -0.692474
C  -9.008741 1.41473 1.789051
H  2.248323 2.375082 -2.163402
H  6.686982 0.175492 0.025337
H  4.960154 -1.295403 -3.683325
H  -1.525806 -1.888425 2.989322
H  -3.196163 -1.413008 -0.990968
H  0.582607 -0.634269 2.243052
H  -1.075513 -0.190665 -1.738426
H  8.72296 -1.23983 -0.362706
H  6.985954 -2.705118 -4.067472
H  -5.496542 -1.581056 3.106664
H  8.882117 -2.68863 -2.414692
H  3.118213 4.641335 2.440331
H  4.538601 3.937507 3.315741
H  3.02151 2.109155 4.238455
H  1.622331 2.855462 3.39222
H  2.436179 3.729615 4.723539
H  -8.018131 1.738787 -0.824667
H  -5.911479 0.639041 -1.723049
H  -9.922535 1.098605 1.252554
H  -9.084773 1.092543 2.838409
H  -8.974114 2.519099 1.753096
