program: Gaussian 09
title: 000270975
version: EM64L-G09RevD.01
frameworkgroup: C1[X(C15H16N10O2S)]
method: RPBEPBE
basis: SDD
operation: Freq
keyword: #p
keyword: freq=noraman
keyword: PBEPBE/SDD
title: #p freq=noraman PBEPBE/SDD
converged: YES YES NO NO
title: Mulliken charges:
elementType: S O O N N N N N N N N N N C C C C C C C C C C C C C C C H H H H H H H H H H H H H H H H
charge: 0.989203 -0.539853 -0.489199 -0.614230 -0.083323 -0.259923 -0.047166 -0.079987 -0.103733 -0.112579 -0.613132 -0.607400 -0.575871 -0.075614 -0.151083 -0.228948 0.275043 -0.321247 -0.357442 0.075489 0.248402 -0.084839 -0.288914 -0.252849 -0.769100 0.185278 0.173138 0.012171 0.286546 0.288171 0.363231 0.256052 0.248056 0.238318 0.241924 0.257204 0.232664 0.235684 0.384132 0.319435 0.345252 0.330483 0.335368 0.335188
chargesum: 0.00000
title: Mulliken charges with hydrogens summed into heavy atoms:
elementType: S O O N N N N N N N N N N C C C C C C C C C C C C C C C
charge: 0.989203 -0.539853 -0.489199 -0.250998 -0.083323 -0.259923 -0.047166 -0.079987 -0.103733 -0.112579 0.090435 0.068335 0.094685 -0.075614 0.135464 0.059223 0.275043 -0.065195 -0.109386 0.075489 0.248402 -0.084839 -0.050596 -0.010925 -0.043549 0.185278 0.173138 0.012171
polarizability: 5.81709912e+02 -4.77316634e+01 2.72272402e+02 4.04913876e+00 4.20341413e+01 1.97050317e+02
1716.lowfreq: -59.8110 -2.5788 0.0001 0.0012 0.0015 2.5476 6.5269 10.4447 13.9628
frequency: -59.7872 10.1988 13.8682 27.9731 34.7100 46.6144 60.7812 66.9038 84.6523 111.7257 127.8555 147.0443 174.8667 179.0453 197.2703 202.3223 206.9535 212.8427 228.0386 239.7823 266.7314 286.4146 318.5005 326.4152 344.1208 357.6011 362.8030 389.9299 410.1614 424.8294 442.0501 451.8797 470.7493 503.2185 520.6099 527.6556 529.3415 530.9431 532.6113 538.7231 560.5750 574.3710 606.5400 615.6427 617.8308 620.5652 627.5334 629.8174 665.4885 680.0410 695.5986 721.4111 731.0558 772.0907 790.3915 790.8977 794.0913 812.9506 827.9902 830.6398 853.0505 879.3742 905.2703 908.8803 923.4007 952.9292 960.6457 967.9380 972.4731 975.0863 978.5600 983.1715 1013.1116 1043.3852 1046.9616 1092.1541 1105.4952 1125.4320 1142.7685 1164.9439 1182.6972 1198.7722 1205.7113 1259.7625 1266.3952 1283.9570 1286.8819 1315.9061 1344.5746 1373.6762 1389.1725 1390.8732 1407.7679 1415.7547 1427.8383 1431.9571 1447.5047 1457.3487 1459.1606 1466.3615 1489.2849 1505.0483 1534.2456 1549.1434 1558.0265 1574.9486 1581.5621 1591.4208 1595.7164 1624.1299 2988.9995 3068.6795 3122.4948 3125.8396 3139.1679 3152.5806 3168.8831 3171.5135 3176.8310 3186.2850 3508.1124 3523.8073 3554.1554 3599.8609 3687.6717 3714.3502
redmass: 1.0206 5.5855 5.7133 5.5899 4.9114 5.0905 5.2439 6.3882 7.2519 6.6960 8.1521 8.9167 7.8690 6.2088 4.5885 5.2292 7.7296 8.7840 6.2784 7.2997 8.4803 5.4933 2.8941 5.2177 3.7618 6.3958 4.0497 4.3850 3.1458 7.8823 3.5908 7.3929 4.5474 1.2243 6.8482 1.8275 1.5915 4.6181 2.5769 2.5433 1.0587 4.1593 3.6734 1.3842 5.8227 1.1083 6.0833 6.7466 5.9219 6.4907 2.9841 8.0503 3.7551 5.6887 7.4669 6.0457 8.1404 12.9943 1.2815 1.3015 1.6394 7.4060 1.1164 4.4792 2.7516 10.0779 3.1117 1.3821 1.4107 2.0350 1.3954 4.4650 2.1440 2.4753 1.6054 1.5664 1.3670 2.0569 2.4354 1.4192 2.3285 3.5723 2.3742 2.4411 4.2359 2.7529 1.4237 1.9203 9.1448 6.8768 1.3475 4.5585 4.2910 2.2896 2.6286 3.6928 4.6611 2.2044 1.2766 1.0491 2.2227 2.1276 5.2290 5.3373 2.4815 5.2540 3.3992 3.4974 2.1526 2.2691 1.0381 1.0971 1.0986 1.0684 1.0905 1.0881 1.0875 1.0971 1.0970 1.0965 1.0773 1.0441 1.0443 1.0868 1.1050 1.1060
irintensity: 0.4083 0.2361 0.5168 0.0886 0.0419 0.2903 0.7682 1.8828 0.7666 0.9254 1.2726 4.7826 3.7479 3.8792 1.7536 13.0008 0.2758 2.0290 5.3002 13.6128 9.5667 11.1553 9.0239 6.6670 37.7688 1.7150 4.0679 41.0488 1.6611 47.2488 13.9344 189.5012 10.9567 176.8176 2.2556 52.4701 185.1135 21.9572 100.5644 25.9163 4.2015 13.0237 5.7726 259.3113 1.9732 42.8268 2.9321 56.8517 4.2470 1.2730 294.3648 4.4701 6.9181 3.7163 14.2437 0.9262 27.6664 174.4422 5.7968 37.5039 34.2764 0.9688 120.7853 2.5572 14.6760 68.5835 13.1237 2.3203 0.3846 13.4664 0.8237 3.3998 53.7929 74.6118 10.0941 7.4136 10.9206 43.7597 13.4466 29.8347 22.6999 16.9742 10.5785 31.4065 256.1519 28.5344 35.0549 7.7360 685.3918 205.7064 86.9772 65.4867 41.5189 14.5580 141.7457 481.5142 62.9315 54.3822 111.8554 18.2933 122.0262 111.6747 150.5004 375.1748 704.9629 88.5383 587.2672 106.3822 858.7560 141.5824 13.9667 14.2724 8.7538 98.5214 11.3756 3.3139 2.2032 4.1354 12.3679 1.6241 93.7136 52.9136 284.7050 89.3332 77.3441 51.4005
temp: 298.150 k
press: 1.00000 atm
elementType: 16 8 8 7 7 7 7 7 7 7 7 7 7 6 6 6 6 6 6 6 6 6 6 6 6 6 6 6 1 1 1 1 1 1 1 1 1 1 1 1 1 1 1 1
symmnumber: 1
zpe: 839623.7 jmol-1
zpe.correction: 0.319796 hartree
zpe.thermalcorrener: 0.345158 hartree
zpe.thermalcorrenthalpy: 0.346102 hartree
zpe.thermalcorrgfe: 0.261338 hartree
zpe.sumelectzpe: -1675.069277 hartree
zpe.sumelectthermal: -1675.043915 hartree
zpe.sumelectthermalent: -1675.042971 hartree
zpe.sumelectthermalfe: -1675.127735 hartree
dipole: -5.4256 6.2422 -2.1066
dipole: 8.5346
quadrupole: -134.8346 -162.6261 -167.5504
quadrupole: 21.8070 -9.5057 16.0122
quadrupole: 20.1691 -7.6224 -12.5467 21.8070 -9.5057 16.0122
hfenergy: -1675.3890727 hartree
pointgroup: C01 [X(C15H16N10O2S1)]
dipole: -2.6151846 -1.2509816 1.6942547 debye
polarizability: 587.1658197|-6.1851472|283.5757832|25.4760738|-14.3581044|180.2910279 unknown
InChI: InChI=1S/C15H16N10O2S/c1-8-6-7-19-15(20-8)25-28(26,27)10-4-2-9(3-5-10)23-24-11-12(16)21-14(18)22-13(11)17/h2-7,25H,16-18H2,1H3
charge 0 multiplicity 1
44 atoms
S  3.708537 0.643191 -1.29691
O  4.307388 2.144172 -1.486394
O  4.043627 -0.533264 -2.355943
N  4.386646 0.23805 0.384928
N  5.273263 -1.236678 1.956784
N  -2.299155 1.244161 -0.627929
N  3.384651 -1.89879 0.535928
N  -3.077442 0.186019 -0.866645
N  -6.519141 1.568901 -0.1946
N  -6.619143 -0.799627 -0.88081
N  -4.451821 2.674363 -0.041848
N  -4.668292 -1.984149 -1.391463
N  -8.536773 0.416378 -0.364571
C  1.855396 0.763959 -1.049105
C  1.068438 -0.385187 -1.245824
C  1.332572 2.029389 -0.73319
C  -0.904668 1.006609 -0.789016
C  -0.32486 -0.2558 -1.115181
C  -0.06433 2.140568 -0.600157
C  4.345412 -1.021961 0.966316
C  5.228084 -2.444234 2.594668
C  -4.435791 0.342516 -0.718335
C  4.274942 -3.429216 2.21253
C  3.37946 -3.105104 1.172827
C  6.234078 -2.68405 3.695752
C  -5.158148 1.543569 -0.312394
C  -5.264835 -0.821368 -0.996673
C  -7.1714 0.398287 -0.483317
H  1.545668 -1.340554 -1.479646
H  1.995792 2.892193 -0.61887
H  5.163593 0.861747 0.637245
H  -0.980287 -1.11838 -1.256835
H  -0.526218 3.102544 -0.35712
H  4.240123 -4.404417 2.704432
H  2.625146 -3.822186 0.83088
H  6.855969 -1.787148 3.836154
H  5.728236 -2.923887 4.649137
H  6.89148 -3.538573 3.44991
H  -3.416826 2.592378 -0.152111
H  -4.957477 3.513162 0.242538
H  -3.653372 -1.999016 -1.48459
H  -5.245736 -2.797762 -1.589902
H  -9.062457 -0.429086 -0.570874
H  -8.997031 1.275983 -0.076377
