program: Gaussian 09
title: 000270940
version: EM64L-G09RevD.01
frameworkgroup: C1[X(C12H22N2O4)]
method: RPBEPBE
basis: SDD
operation: Freq
keyword: #p
keyword: freq=noraman
keyword: PBEPBE/SDD
title: #p freq=noraman PBEPBE/SDD
converged: YES YES NO NO
title: Mulliken charges:
elementType: O O O O N N C C C C C C C C C C C C H H H H H H H H H H H H H H H H H H H H H H
charge: -0.277139 -0.290200 -0.262299 -0.246811 -0.088949 -0.112657 -0.487835 0.171453 -0.269929 -0.374522 -0.599186 0.199989 -0.782717 0.272756 -0.264166 -0.496001 -0.495308 -0.661626 0.227188 0.238756 0.224573 0.193497 0.242920 0.229464 0.276480 0.249942 0.280155 0.260357 0.216299 0.233225 0.225003 0.200573 0.197792 0.230805 0.231871 0.204237 0.208248 0.228056 0.248134 0.217570
chargesum: 0.00000
title: Mulliken charges with hydrogens summed into heavy atoms:
elementType: O O O O N N C C C C C C C C C C C C
charge: -0.277139 -0.290200 -0.262299 -0.246811 -0.088949 -0.112657 -0.021891 0.171453 0.148141 0.097862 -0.072764 0.199989 -0.025905 0.272756 0.194063 0.133169 0.149048 0.032135
polarizability: 2.18739459e+02 1.23622027e+01 1.44241768e+02 3.42731792e+00 1.76208301e+00 1.36989215e+02
1716.lowfreq: -15.9778 -8.2902 -1.6275 -0.0009 -0.0007 0.0003 5.9670 14.3008 21.8104
frequency: -11.3320 12.6103 21.6030 28.9549 39.9158 58.1271 73.4399 81.4172 85.1705 89.4551 95.2905 108.0945 120.4850 147.5026 163.4628 201.2426 215.9756 232.8991 233.5091 252.9316 276.6133 291.1096 310.4492 325.6122 355.9270 364.2321 408.0496 437.1503 470.4777 502.5903 543.9811 561.3368 610.7315 645.5833 672.7303 771.9837 786.9086 797.8591 801.3392 827.0425 880.5524 894.5049 910.7564 938.0881 964.7870 979.9454 1008.4898 1014.5246 1025.9956 1040.8979 1060.6613 1066.5542 1089.6389 1095.1587 1116.1730 1117.9053 1122.3700 1144.2597 1154.2589 1155.5156 1180.3472 1190.6209 1198.3049 1233.5287 1269.3889 1278.5336 1285.4706 1322.0453 1336.2603 1349.3043 1357.0515 1366.1341 1380.8418 1389.3296 1422.9665 1427.3339 1435.3314 1437.2728 1453.0780 1455.1047 1455.9409 1456.4374 1458.7424 1462.3795 1467.4664 1469.0783 1477.1930 1484.7090 1493.0108 1605.4317 1609.5046 1639.2297 2907.8483 2916.9963 2929.3865 2930.2944 2953.6631 2978.5249 2987.7321 2990.6225 2992.5974 2998.8655 3004.7288 3010.3685 3028.7433 3060.0117 3062.0886 3087.3603 3088.0620 3092.5429 3098.3987 3099.9921 3103.8801 3118.6167
redmass: 3.8383 3.7175 4.2062 4.2423 3.3892 3.5795 4.2203 2.7397 2.3093 2.1157 2.4241 2.9122 1.4563 3.0530 3.0973 1.7468 1.4518 1.1751 1.8473 2.3810 2.8025 3.6136 2.8006 2.8939 4.8086 2.7882 2.9505 3.3988 3.5199 4.1975 3.0055 3.4452 3.5548 4.3128 4.3108 3.6555 2.8451 2.4223 1.7889 2.8764 3.7788 2.4214 4.3345 2.0467 2.0382 2.4799 1.9629 2.6432 1.8093 2.0351 3.3593 6.0998 2.7871 2.1766 1.3214 1.2690 3.2423 1.3269 1.4947 1.6657 1.3064 1.1898 1.1479 1.2891 2.2234 1.1193 2.1509 2.3053 1.7579 1.4163 1.3241 1.3281 1.2331 1.2336 1.1018 1.1034 1.1287 1.1418 1.0822 1.0751 1.0518 1.0919 1.0515 1.0431 1.0654 1.0565 1.0598 1.0516 1.0754 8.8813 7.2232 8.7183 1.0556 1.0375 1.0495 1.0394 1.1014 1.0363 1.1007 1.1026 1.0360 1.0601 1.1027 1.0636 1.0596 1.0978 1.0977 1.1001 1.0974 1.1031 1.0968 1.1001 1.0978 1.1061
irintensity: 1.1795 0.2848 0.2356 0.2505 1.5442 1.2231 1.6387 11.2947 6.8125 6.1707 2.4221 0.1335 1.2344 1.9363 1.4381 7.9633 2.4493 5.1236 3.7400 2.4774 5.9332 8.1980 6.6708 1.0806 3.2997 0.2177 3.5626 2.3009 2.1373 7.0785 1.0041 6.3731 3.1002 18.9870 16.5301 4.5984 2.3291 13.2434 1.2240 2.5672 6.6130 6.5853 25.2175 12.3900 10.6477 22.0247 5.1938 34.5862 90.3754 28.4466 42.2956 125.3362 48.9977 46.7722 7.9072 0.1115 366.7964 4.6846 7.8237 17.4400 13.9773 12.1326 8.0468 2.1486 13.3966 3.4884 10.8999 76.4429 5.1964 16.9413 6.3166 1.9704 46.1161 25.0206 27.2002 18.9270 1.4061 0.1806 32.0435 9.7234 8.4193 11.9043 12.3519 12.7195 22.7126 16.4244 9.9468 11.3889 6.1200 23.7914 19.1139 132.1557 23.5190 62.6775 113.0694 89.0128 28.2624 14.8848 110.3252 7.2305 20.0221 19.5421 63.4917 30.6391 31.2242 5.4807 15.3572 14.4014 36.4675 0.7463 27.9545 5.9218 34.0607 34.9732
temp: 298.150 k
press: 1.00000 atm
elementType: 8 8 8 8 7 7 6 6 6 6 6 6 6 6 6 6 6 6 1 1 1 1 1 1 1 1 1 1 1 1 1 1 1 1 1 1 1 1 1 1
symmnumber: 1
zpe: 867852.0 jmol-1
zpe.correction: 0.330547 hartree
zpe.thermalcorrener: 0.352391 hartree
zpe.thermalcorrenthalpy: 0.353335 hartree
zpe.thermalcorrgfe: 0.275731 hartree
zpe.sumelectzpe: -879.347013 hartree
zpe.sumelectthermal: -879.325170 hartree
zpe.sumelectthermalent: -879.324226 hartree
zpe.sumelectthermalfe: -879.401830 hartree
dipole: -1.5376 0.5847 3.1984
dipole: 3.5966
quadrupole: -85.9295 -101.2454 -110.4610
quadrupole: 0.2491 5.0346 1.1093
quadrupole: 13.2824 -2.0334 -11.2490 0.2491 5.0346 1.1093
hfenergy: -879.6775608 hartree
pointgroup: C01 [X(C12H22N2O4)]
dipole: -0.650398 0.1557158 -1.2470135 debye
polarizability: 218.4363971|-9.5637102|142.2686902|-9.8220191|3.7737573|139.2653541 unknown
InChI: InChI=1S/C12H22N2O4/c1-5-18-12(15)8-10(2)13-14-11(9-17-4)6-7-16-3/h5-9H2,1-4H3
charge 0 multiplicity 1
40 atoms
O  3.183226 1.905825 -0.14951
O  2.955758 -2.10785 -1.054972
O  -4.474702 -0.649037 0.440039
O  -2.631656 -0.086156 -0.877707
N  1.343149 -0.357213 1.7139
N  0.035422 -0.862311 1.607629
C  3.631494 -0.230776 0.925058
C  2.199458 -0.689198 0.773301
C  4.069246 0.73437 -0.190373
C  1.777754 -1.476485 -0.455061
C  -2.351273 -0.58399 1.542146
C  -0.95304 0.000243 1.506274
C  -0.788188 1.495201 1.344286
C  -3.116521 -0.393698 0.235312
C  -5.365575 -0.543856 -0.759154
C  3.538158 2.895128 -1.162292
C  2.601818 -2.91362 -2.221844
C  -5.836592 0.89938 -0.957975
H  4.304574 -1.108077 0.885917
H  3.734823 0.259833 1.907638
H  4.003571 0.2344 -1.179809
H  5.123733 1.048054 -0.021007
H  1.020889 -2.233493 -0.147497
H  1.284431 -0.80104 -1.19233
H  -2.281856 -1.669185 1.743098
H  -2.952448 -0.141785 2.359302
H  0.230941 1.805272 1.62936
H  -0.949922 1.779635 0.286818
H  -1.532992 2.042326 1.950955
H  -4.811639 -0.910913 -1.641108
H  -6.199155 -1.223698 -0.521294
H  4.568455 3.284796 -1.01062
H  3.467778 2.475251 -2.189465
H  2.817787 3.721823 -1.056029
H  3.544218 -3.337916 -2.60244
H  2.126504 -2.296625 -3.014309
H  1.908997 -3.737968 -1.950366
H  -6.337734 1.278816 -0.050816
H  -4.98635 1.558585 -1.200594
H  -6.557443 0.944452 -1.79546
