program: Gaussian 09
title: 000270937
version: EM64L-G09RevD.01
frameworkgroup: C1[X(C20H32N6O2)]
method: RPBEPBE
basis: SDD
operation: Freq
keyword: #p
keyword: freq=noraman
keyword: PBEPBE/SDD
title: #p freq=noraman PBEPBE/SDD
converged: YES YES NO NO
title: Mulliken charges:
elementType: O O N N N N N N C C C C C C C C C C C C C C C C C C C C H H H H H H H H H H H H H H H H H H H H H H H H H H H H H H H H
charge: -0.338705 -0.199347 -0.125444 -0.393257 0.061979 -0.037377 0.036600 -0.465424 -0.378373 -0.405421 -0.054769 -0.383357 -0.756593 -0.331415 -0.315662 0.377324 -0.683816 -0.698857 -0.060459 -0.520881 -0.221058 0.151511 0.245443 -0.453812 -0.783283 0.252057 -0.254693 -0.661861 0.251696 0.206317 0.210154 0.189726 0.213319 0.215226 0.196411 0.331061 0.238576 0.231911 0.213998 0.191666 0.212119 0.207635 0.189913 0.218514 0.206850 0.239454 0.217441 0.225005 0.219130 0.290052 0.250167 0.370654 0.227494 0.226744 0.264853 0.238712 0.216310 0.254679 0.219592 0.213571
chargesum: 0.00000
title: Mulliken charges with hydrogens summed into heavy atoms:
elementType: O O N N N N N N C C C C C C C C C C C C C C C C C C C C
charge: -0.338705 -0.199347 -0.125444 -0.062196 0.061979 -0.037377 0.036600 -0.094770 0.079640 -0.005541 0.158550 0.028280 -0.072108 0.072369 0.081885 0.377324 -0.018998 -0.037282 -0.060459 -0.230829 -0.221058 0.151511 0.245443 -0.203645 -0.064191 0.252057 0.200329 0.025980
polarizability: 3.86993422e+02 9.21960850e+00 3.20455591e+02 -9.13282464e+00 1.11461041e+01 1.79948653e+02
1716.lowfreq: -30.4871 -6.3911 -3.0983 0.0007 0.0008 0.0011 3.6063 15.7372 21.6423
frequency: -30.4618 15.4430 21.5242 28.3599 33.9973 39.0741 57.8751 59.9553 67.7159 72.2683 83.2398 90.1595 100.0336 102.5842 106.8065 124.5417 151.5977 187.3789 195.0247 204.9784 219.2608 227.1164 234.9190 240.2342 249.0563 258.9358 264.1970 286.6995 288.3597 298.1643 301.6610 315.8819 328.8746 336.9097 370.0189 408.8605 415.6609 438.4141 457.1857 465.0284 466.5692 486.0423 502.0568 548.8635 567.4204 605.3613 611.4108 623.9013 647.5015 657.2207 669.1587 679.3618 692.5398 696.3401 718.1853 760.7201 771.8794 785.1818 803.5450 804.3648 808.7324 814.3199 839.1344 872.7002 876.3449 886.1150 892.1540 907.2733 914.4505 920.0669 941.7586 954.0147 976.8354 983.6989 1026.9838 1034.7690 1045.5357 1047.3685 1052.7766 1069.1506 1075.4414 1084.8300 1089.5122 1094.1519 1103.4130 1108.5369 1123.9124 1126.0779 1156.3963 1164.6284 1181.0611 1190.7009 1214.8103 1215.9777 1242.2466 1248.3693 1255.6030 1272.3032 1274.8641 1282.1568 1286.9133 1292.9287 1305.7066 1322.0815 1348.1009 1350.1492 1355.6724 1358.9056 1360.9615 1365.2836 1373.1577 1376.8210 1384.8392 1388.4520 1388.7444 1389.6747 1392.9486 1393.9279 1422.0011 1433.2321 1456.8953 1458.7565 1462.0092 1462.3298 1463.6953 1466.4853 1467.2585 1472.2654 1474.6397 1475.5312 1478.7907 1479.6658 1482.6414 1483.8109 1484.5215 1491.3540 1497.0402 1529.0418 1532.3900 1560.6733 1614.8573 1708.8618 2859.8221 2865.3454 2880.1305 2932.7263 2968.5233 2978.5780 2979.4008 2982.8118 2988.2287 2989.4981 2990.8376 3022.6423 3024.4718 3027.6401 3029.1907 3045.5308 3058.6800 3060.8598 3073.0110 3074.3149 3077.8831 3080.4381 3083.9129 3087.7904 3089.7540 3091.9954 3113.4110 3120.4852 3120.8395 3134.3824 3490.4418 3531.2655
redmass: 1.0259 3.8147 3.7867 4.1614 3.6259 5.0091 4.1015 4.6660 3.7957 3.6235 4.8931 3.4590 1.8882 3.6906 2.3393 2.9935 5.2910 1.9791 1.6378 1.8431 2.1181 2.6720 1.4518 2.0361 1.7440 2.4840 2.8496 2.7146 2.5874 1.8524 4.3959 3.1267 3.3243 2.4363 3.8110 2.3733 3.4407 2.4268 5.5757 2.9743 4.9407 4.5561 2.5437 4.9643 6.5776 4.1450 5.4053 1.3065 2.0964 4.4707 2.7881 6.5717 2.4215 3.5030 3.1740 4.6658 6.0257 1.3092 1.1748 1.1934 1.4417 7.2403 2.1607 1.8019 2.9958 1.9591 1.3361 3.6100 2.2580 1.6313 2.2195 3.1770 1.9026 1.7117 3.4663 2.8166 1.5976 2.0821 4.7484 1.9705 2.9601 2.0989 3.0230 2.2051 2.0684 2.2547 2.5601 2.6144 1.7212 1.9421 2.7800 2.3349 2.3315 1.5016 4.1329 1.5707 1.4524 1.2404 2.9916 1.1083 1.1380 1.1804 1.2680 1.4190 1.2767 1.7220 1.2653 1.5246 1.8559 1.2942 2.2893 1.4327 2.2720 1.2581 1.2501 1.5776 1.2521 1.2272 2.7708 2.3991 1.0864 1.1818 1.1707 1.0470 1.0733 1.0471 1.1120 1.0757 1.0908 1.0450 1.1953 1.0816 1.9908 1.0662 1.0867 1.0843 1.0906 3.3904 3.0284 3.5009 5.5892 8.6875 1.0721 1.0716 1.0708 1.0830 1.0634 1.0370 1.0361 1.0382 1.0363 1.0359 1.0650 1.0932 1.0594 1.0872 1.0879 1.0902 1.1002 1.0971 1.0990 1.0978 1.1004 1.0984 1.0987 1.1024 1.0992 1.0998 1.1053 1.0981 1.0944 1.0923 1.0766 1.0759
irintensity: 0.5771 0.0316 0.5506 0.7025 0.2060 1.8351 0.2839 1.1247 0.3496 0.3580 0.0480 0.2691 0.3037 0.6358 0.2960 0.5836 6.0701 1.3946 4.9054 0.5901 0.4296 0.1786 0.0113 1.0587 1.5022 0.7904 1.9870 1.6623 0.5130 2.4673 0.1525 8.3615 3.8681 4.3597 1.9713 3.0187 4.8595 3.3106 1.3363 0.9527 2.9537 3.2422 2.8337 1.5911 12.6776 13.7007 11.0832 30.8621 56.3785 17.4447 4.5322 9.8152 13.5105 3.2562 56.9967 22.1940 1.2551 2.1379 2.4771 4.2449 8.6931 0.9923 4.6753 28.7065 6.7302 17.1950 18.3078 49.2823 4.4259 2.3163 32.0262 54.5481 3.8743 12.5693 118.1925 51.0154 7.4029 79.5880 254.4260 14.3404 12.7052 0.3337 17.1027 77.9824 11.1585 8.1831 116.4931 147.9022 6.3985 11.5021 40.0669 27.2078 39.6025 19.7764 21.8034 22.3914 27.1524 10.9128 81.2237 3.2157 4.0776 8.5852 8.9923 1.1834 9.1917 30.9931 7.1153 40.2239 44.2247 1.7947 91.6140 17.4315 50.7111 50.1903 35.8748 29.4284 6.3896 17.1209 163.8203 134.4386 24.6390 9.8805 11.3872 9.3317 5.9252 16.0181 18.1384 8.0621 34.8399 14.0676 143.8181 21.0400 252.0663 6.1688 45.2262 30.3780 12.0316 177.8128 273.3810 392.2845 383.1034 245.9444 28.6465 83.0962 265.4574 20.0264 43.3108 28.2199 19.8428 20.7448 15.9946 24.7568 25.4613 29.8488 40.0917 7.1939 17.9541 41.3108 35.2231 18.2431 28.9587 56.7978 29.5208 56.0282 36.6967 9.3346 28.0016 42.3685 34.7458 6.0045 12.1004 21.2262 60.1684 94.0121
temp: 298.150 k
press: 1.00000 atm
elementType: 8 8 7 7 7 7 7 7 6 6 6 6 6 6 6 6 6 6 6 6 6 6 6 6 6 6 6 6 1 1 1 1 1 1 1 1 1 1 1 1 1 1 1 1 1 1 1 1 1 1 1 1 1 1 1 1 1 1 1 1
symmnumber: 1
zpe: 1326441.2 jmol-1
zpe.correction: 0.505215 hartree
zpe.thermalcorrener: 0.534924 hartree
zpe.thermalcorrenthalpy: 0.535868 hartree
zpe.thermalcorrgfe: 0.442171 hartree
zpe.sumelectzpe: -1258.143317 hartree
zpe.sumelectthermal: -1258.113608 hartree
zpe.sumelectthermalent: -1258.112664 hartree
zpe.sumelectthermalfe: -1258.206361 hartree
dipole: 3.7338 -6.4436 -0.7174
dipole: 7.4817
quadrupole: -141.1262 -168.9283 -167.6457
quadrupole: 11.6587 -0.1253 -0.6833
quadrupole: 18.1072 -9.6949 -8.4123 11.6587 -0.1253 -0.6833
hfenergy: -1258.6485318 hartree
pointgroup: C01 [X(C20H32N6O2)]
dipole: 2.5542553 1.080922 0.9858277 debye
polarizability: 347.6266856|-43.0038457|343.2312721|34.1598688|32.482091|196.5397088 unknown
InChI: InChI=1S/C20H32N6O2/c1-6-26(7-2)11-9-10-14(4)22-16-12-17(25-20(27)28-8-3)24-19-18(16)21-13-15(5)23-19/h12-14,22,25H,6-11H2,1-5H3
charge 0 multiplicity 1
60 atoms
O  0.744698 -3.90391 -0.950101
O  -1.51079 -3.386607 -1.435326
N  3.794849 -0.273462 0.032474
N  0.209423 2.812803 0.941402
N  -1.93698 -0.505222 -0.70848
N  -2.42679 3.095812 0.174986
N  -3.850713 0.865007 -0.922132
N  0.038169 -1.82721 -0.480351
C  2.64659 2.649918 0.335443
C  4.019573 2.123189 0.837893
C  1.585438 2.777477 1.468367
C  4.587578 0.993283 -0.054576
C  1.823972 4.016868 2.351706
C  3.903261 -1.089859 -1.21817
C  4.198695 -1.065299 1.23624
C  -0.433714 1.721776 0.415307
C  3.139399 -0.492369 -2.414593
C  3.140034 -2.084989 1.696906
C  -1.823193 1.869826 0.012493
C  0.147081 0.452824 0.237588
C  -2.52254 0.730587 -0.537929
C  -0.64677 -0.600346 -0.324584
C  -4.436457 2.075854 -0.75992
C  -3.716343 3.193644 -0.20799
C  -5.88265 2.220213 -1.178033
C  -0.397307 -3.045028 -0.999324
C  0.49669 -5.303548 -1.389966
C  -0.039984 -6.155718 -0.235627
H  2.260908 1.948583 -0.425068
H  2.757313 3.633256 -0.161943
H  4.763988 2.942192 0.880896
H  3.921203 1.74652 1.877095
H  1.674262 1.867855 2.103339
H  4.575976 1.340051 -1.103478
H  5.658579 0.806343 0.207393
H  -0.356975 3.665213 1.007812
H  2.849368 4.005445 2.759782
H  1.116932 4.050737 3.200212
H  1.707828 4.945522 1.760537
H  4.976421 -1.248335 -1.495668
H  3.48648 -2.091481 -1.004523
H  4.378833 -0.351509 2.061364
H  5.171422 -1.588612 1.054164
H  3.198207 -1.178705 -3.279115
H  3.553121 0.480533 -2.735253
H  2.074273 -0.343834 -2.164977
H  3.501186 -2.62877 2.589411
H  2.914766 -2.843109 0.924389
H  2.199518 -1.573013 1.971368
H  1.200151 0.263622 0.471174
H  -4.204893 4.165808 -0.082286
H  1.015694 -1.83164 -0.177993
H  -6.521435 2.505825 -0.321207
H  -6.001501 3.002615 -1.950851
H  -6.240457 1.261763 -1.583445
H  -0.215356 -5.285523 -2.234129
H  1.484069 -5.649921 -1.736903
H  -1.033241 -5.79658 0.082492
H  0.645809 -6.126031 0.629176
H  -0.142272 -7.207936 -0.561175
