program: Gaussian 09
title: 000270929
version: EM64L-G09RevD.01
frameworkgroup: C1[X(C8H9N5OS)]
method: RPBEPBE
basis: SDD
operation: Freq
keyword: #p
keyword: freq=noraman
keyword: PBEPBE/SDD
title: #p freq=noraman PBEPBE/SDD
converged: YES YES NO NO
title: Mulliken charges:
elementType: S O N N N N N C C C C C C C C H H H H H H H H H
charge: 0.283115 -0.216732 -0.149249 -0.374476 -0.039078 -0.003367 0.004155 0.149745 0.133741 -0.179099 -0.355706 0.279390 -0.374954 -0.755721 -0.822680 0.279279 0.335213 0.248774 0.218753 0.263666 0.266188 0.281650 0.283812 0.243581
chargesum: 0.00000
title: Mulliken charges with hydrogens summed into heavy atoms:
elementType: S O N N N N N C C C C C C C C
charge: 0.283115 -0.216732 -0.149249 -0.039263 -0.039078 -0.003367 0.004155 0.149745 0.133741 0.100180 -0.355706 0.279390 -0.126180 -0.007114 -0.013636
polarizability: 2.21716524e+02 1.22398165e+00 1.36910050e+02 -1.11782669e+01 -9.55454479e-01 8.06530554e+01
1716.lowfreq: -1.8291 -0.0012 0.0005 0.0007 5.3015 6.1648 24.2716 43.5355 60.5601
frequency: 24.0538 43.5184 60.5557 75.1522 82.8320 107.3294 126.5854 152.4078 210.7839 238.2697 255.8147 281.6006 330.8078 365.3450 402.6815 469.7220 516.8688 534.7470 555.1046 591.4293 610.4248 631.1192 639.3444 657.5255 672.1299 781.0797 791.4229 820.9860 828.7550 899.6851 914.5643 922.5260 977.8158 987.4753 992.4887 1039.0503 1099.9612 1136.0748 1178.4955 1194.7588 1237.3953 1278.2805 1301.7715 1306.8648 1344.6019 1385.7840 1388.5081 1393.0176 1433.9918 1441.3434 1448.5044 1449.1916 1458.6374 1469.8956 1523.2719 1541.5701 1654.6252 3002.1735 3027.5054 3099.6085 3114.1213 3152.8660 3160.0621 3173.0621 3247.0600 3536.7669
redmass: 5.6179 5.0854 2.0248 4.1109 1.4516 1.2611 3.7404 4.5981 9.6676 4.2007 5.0914 4.2550 4.8206 4.7581 11.1517 1.3340 4.6284 4.2919 6.8188 3.2695 6.8189 6.7744 5.4127 7.2990 7.8821 7.2358 4.7662 8.0456 1.7418 6.1814 4.4088 1.4387 1.1802 1.7426 1.3759 1.6394 5.2221 6.3928 4.8551 2.2651 2.1523 5.9762 5.2317 7.4535 1.1356 2.7538 1.3050 2.1467 1.0525 2.3819 1.0781 1.3220 1.4511 1.1096 9.7144 10.6057 8.1386 1.0361 1.0281 1.0993 1.0997 1.1043 1.1055 1.0924 1.0998 1.0794
irintensity: 2.8014 4.5093 8.9010 1.9182 1.9177 0.2458 1.0963 4.6645 0.8969 1.8433 0.4318 4.3578 1.4349 2.3467 3.4968 103.8540 17.5047 1.2048 18.3309 0.0311 4.6434 2.8359 29.1605 4.1596 0.8098 30.2455 7.3598 11.1198 10.0077 66.1025 21.6749 11.4201 6.6642 18.7464 15.6615 12.0857 4.7102 7.5432 95.8706 133.0060 33.8071 27.6581 58.2432 122.0552 1.5720 43.4893 24.7964 33.5706 14.5330 25.2590 16.3597 42.7845 72.5552 19.6460 245.1403 52.0592 157.4561 6.6560 21.6302 12.0889 8.9530 7.5712 9.4138 13.3939 1.5163 28.8410
temp: 298.150 k
press: 1.00000 atm
elementType: 16 8 7 7 7 7 7 6 6 6 6 6 6 6 6 1 1 1 1 1 1 1 1 1
symmnumber: 1
zpe: 453215.8 jmol-1
zpe.correction: 0.172621 hartree
zpe.thermalcorrener: 0.187130 hartree
zpe.thermalcorrenthalpy: 0.188074 hartree
zpe.thermalcorrgfe: 0.128919 hartree
zpe.sumelectzpe: -1056.179992 hartree
zpe.sumelectthermal: -1056.165483 hartree
zpe.sumelectthermalent: -1056.164539 hartree
zpe.sumelectthermalfe: -1056.223694 hartree
dipole: 2.6434 2.1847 -3.1426
dipole: 4.6515
quadrupole: -67.6869 -98.4696 -97.3206
quadrupole: -1.1653 -12.3512 2.2800
quadrupole: 20.1388 -10.6439 -9.4949 -1.1653 -12.3512 2.2800
hfenergy: -1056.352613 hartree
pointgroup: C01 [X(C8H9N5O1S1)]
dipole: -0.8833665 -0.9351854 -1.3015889 debye
dipolederiv: -0.6711415 -0.1963063 -0.1346375 -0.5094224 -0.0589739 -0.1253192 -0.1299165 -0.0470692 -0.0819044 -0.5957538 -0.0821477 -0.0763633 0.0338462 -0.4248668 -0.2724253 0.3337572 -0.1729515 -0.8245651 -0.285866 0.0692159 -0.0355058 -0.0127403 -0.2271954 -0.1005939 -0.0211966 0.0210355 -0.142388 -0.5391024 0.0981577 0.2646734 0.0981585 -0.3124117 0.2049469 0.5923627 0.0912564 -0.5226146 -0.7002417 0.0184997 -0.0429026 0.0101597 -0.3595408 0.0349809 -0.1459139 0.0084661 -0.2325667 -0.6755441 0.0053837 -0.115673 0.0066755 -0.5316115 -0.0131365 -0.1390357 0.0126694 -0.2167806 -0.6609691 -0.1424931 -0.1043443 -0.6172922 -0.8790719 -0.1122734 -0.0962291 0.004379 -0.175507 0.7606456 -0.269104 0.1487962 -0.0880212 0.2567527 0.0681729 0.1673371 -0.0704006 0.1697952 -0.7285624 -0.2231725 -0.1576784 -0.426443 0.1003615 -0.0991614 -0.1740835 -0.0580297 0.0356281 0.4117481 0.1597293 0.0722942 0.6053528 0.4323382 0.0374802 0.0174383 0.0475318 -0.0077816 1.3739069 0.442716 0.3054212 0.8350054 0.5917819 0.1780467 0.3158837 0.0767092 0.067261 1.4127642 0.2327569 -0.2922509 0.0609945 0.4012076 0.3054901 -0.9258663 0.2299798 1.2089071 0.7141622 0.0919605 0.1749651 0.1624716 0.5834052 0.0145131 0.1955222 -0.0187791 -0.0035721 -0.4127268 -0.1620126 -0.0492815 -0.1862758 -0.0958803 -0.0310195 0.0387782 -0.0051095 0.0398522 0.2132309 -0.0624099 0.0458286 -0.0636391 0.0366126 -0.0107316 0.046874 -0.0147333 0.0616079 0.0546936 0.0435815 -0.0353877 0.0205729 0.0999214 0.0076667 -0.0157022 0.0034866 0.1565115 0.0804021 -0.0513919 0.0386166 -0.0871471 0.2404728 -0.1032193 0.0309308 -0.0689897 0.2260437 0.070963 0.0173828 -0.0145626 0.0025861 -0.0733447 0.0086245 -0.0165209 0.0154616 0.1259238 0.0796719 -0.0143112 0.034292 -0.0228436 0.0935775 -0.0530146 -0.0379978 -0.0729114 -0.1262578 -0.0182111 0.0548655 0.0113543 0.0952815 0.0489421 -0.0336021 0.0098668 -0.0534443 0.1052065 0.106449 0.0056669 -0.019485 -0.0327837 0.0061497 0.0673343 -0.0179156 0.0811127 0.0488264 0.0539539 0.0284816 -0.0057058 0.1261556 0.0039865 -0.0651693 -0.0010306 -0.0625267 -0.0134529 0.0372224 -0.0027246 0.0369466 0.079498 0.0229977 0.1117904 0.022551 0.0646476 -0.0130553 -0.0816951 -0.0623241 -0.0494097 -0.0901502 0.0443896 -0.0193808 -0.0498933 -0.0117907 0.1148824 unknown
polarizability: 217.904767|4.5300138|137.121003|24.877707|-0.0747766|84.2538599 unknown
InChI: InChI=1S/C8H9N5OS/c1-5(14)12-13-4-11-6-7(13)9-3-10-8(6)15-2/h3-4,12H,1-2H3
charge 0 multiplicity 1
24 atoms
S  3.555514 1.281078 0.696401
O  -3.309512 0.7318 1.35767
N  -1.276721 0.585338 -0.552767
N  -2.569746 0.118497 -0.76969
N  0.417164 2.072467 -0.159432
N  -0.076702 -1.545423 -0.104654
N  2.267842 -1.151163 0.498722
C  -0.165612 -0.194267 -0.191773
C  0.87961 0.753084 0.029542
C  -0.870709 1.934817 -0.497876
C  2.139591 0.20369 0.389041
C  -3.528675 0.148487 0.267805
C  1.179481 -1.946859 0.252616
C  -4.825913 -0.566686 -0.081009
C  4.85948 -0.009002 1.120795
H  -1.567062 2.743935 -0.70417
H  -2.707849 -0.453214 -1.606001
H  1.338111 -3.023962 0.353952
H  -4.896168 -0.86206 -1.141734
H  -5.676158 0.08906 0.167646
H  -4.909824 -1.472237 0.545169
H  5.003037 -0.686827 0.268459
H  4.540496 -0.582378 2.001705
H  5.775023 0.565225 1.330786
