program: Gaussian 09
title: 000270928
version: EM64L-G09RevD.01
frameworkgroup: C1[X(C10H12FN5O3)]
method: RPBEPBE
basis: SDD
operation: Freq
keyword: #p
keyword: freq=noraman
keyword: PBEPBE/SDD
title: #p freq=noraman PBEPBE/SDD
converged: YES YES NO NO
title: Mulliken charges:
elementType: F O O O N N N N N C C C C C C C C C C H H H H H H H H H H H H
charge: -0.157021 -0.261762 -0.467284 -0.436798 -0.177117 -0.079095 -0.048760 -0.066619 -0.609147 -0.084098 -0.135553 -0.505917 -0.045179 -0.384928 0.174596 -0.233593 -0.116237 0.176421 -0.020097 0.284634 0.263052 0.251180 0.254556 0.251892 0.219960 0.224319 0.331772 0.352277 0.356607 0.348421 0.339517
chargesum: 0.00000
title: Mulliken charges with hydrogens summed into heavy atoms:
elementType: F O O O N N N N N C C C C C C C C C C
charge: -0.157021 -0.261762 -0.115007 -0.080191 -0.177117 -0.079095 -0.048760 -0.066619 0.078790 0.200536 0.127499 -0.000181 0.206714 0.059351 0.174596 0.098179 -0.116237 0.176421 -0.020097
polarizability: 2.08132490e+02 1.42445136e-01 1.52138766e+02 -7.94791163e+00 8.87526573e+00 9.42991741e+01
1716.lowfreq: -4.2718 -0.0006 -0.0006 0.0000 0.6941 3.8945 26.0871 38.0917 56.0930
frequency: 25.8427 38.0609 56.0835 94.2726 115.8502 126.7969 144.0356 163.8772 196.8215 235.0318 259.1192 277.9457 287.3719 325.5058 342.4696 362.6946 368.6178 397.3031 443.5209 468.8070 479.6346 529.4982 543.3640 550.3569 604.3833 626.7029 636.9211 648.7994 666.5982 669.8254 681.9810 686.3340 781.9495 787.2322 789.8865 815.9350 839.2361 875.3300 888.8589 924.3381 943.3651 944.4568 965.8577 1008.1761 1030.5386 1046.5341 1051.5345 1063.4010 1085.6515 1149.0326 1160.1980 1174.7283 1180.8887 1206.2045 1234.0250 1248.3078 1264.6513 1288.6686 1296.9727 1308.7762 1317.0824 1328.7555 1335.7699 1367.8411 1369.3554 1387.0229 1394.3150 1416.3138 1441.2605 1448.0095 1461.2713 1464.6366 1556.2406 1580.8016 1636.5758 2989.6651 3016.3515 3023.6175 3037.8185 3078.1346 3088.4038 3101.4442 3210.7371 3539.4864 3542.9156 3576.8353 3693.4158
redmass: 5.1421 6.5080 6.2642 5.7559 4.8779 6.5411 9.0778 5.7554 5.2489 6.5643 3.1849 3.0284 3.6056 1.7339 2.4345 6.9416 3.1481 2.5971 2.0677 5.0621 2.8634 1.2421 6.8288 1.0859 4.2613 5.0522 4.9780 7.7522 6.4761 6.1549 6.2864 11.5609 7.4447 8.5268 6.9791 3.1367 3.4587 3.1116 1.2957 4.5385 3.7791 3.3797 3.3051 2.9120 2.5274 3.3035 3.0016 2.7757 1.7264 3.1611 1.2796 1.2106 1.2612 1.9434 2.4403 1.6897 1.3751 2.4334 1.7594 1.3938 1.3842 8.6668 1.2937 2.3785 2.1134 1.4567 5.2157 1.6136 3.4537 1.1204 1.0815 4.4416 7.1142 1.9904 2.6908 1.0662 1.0848 1.0777 1.0711 1.0887 1.0988 1.1039 1.1019 1.0445 1.0653 1.0664 1.1057
irintensity: 0.4928 0.6727 0.8077 15.6575 11.3208 0.2599 2.5982 0.5835 7.1065 1.6756 0.6587 5.8773 9.4802 96.4700 71.9038 9.0443 23.9096 6.3673 128.4827 29.3947 77.3302 265.3868 1.1041 6.5729 13.0846 26.7680 36.7647 15.5466 14.4724 2.4602 23.8336 11.2633 30.7660 3.4086 12.3411 20.9575 30.9131 53.2000 17.9286 7.5576 114.1907 33.9561 44.1049 7.4602 148.9947 23.4706 6.9820 25.6970 37.7017 51.3664 6.1513 7.3386 69.9272 56.4691 108.9035 125.5203 19.1614 21.5889 4.4751 1.2431 1.5663 288.2893 31.8648 15.4476 50.5983 11.8331 65.0757 8.9196 21.8484 17.3717 7.6910 33.7882 128.7523 78.9325 649.0044 39.3396 34.0761 11.7719 22.6990 4.1153 21.1995 12.7066 54.6346 138.5700 6.3181 9.7552 54.4191
temp: 298.150 k
press: 1.00000 atm
elementType: 9 8 8 8 7 7 7 7 7 6 6 6 6 6 6 6 6 6 6 1 1 1 1 1 1 1 1 1 1 1 1
symmnumber: 1
zpe: 608978.4 jmol-1
zpe.correction: 0.231948 hartree
zpe.thermalcorrener: 0.248506 hartree
zpe.thermalcorrenthalpy: 0.249450 hartree
zpe.thermalcorrgfe: 0.186885 hartree
zpe.sumelectzpe: -986.119821 hartree
zpe.sumelectthermal: -986.103263 hartree
zpe.sumelectthermalent: -986.102319 hartree
zpe.sumelectthermalfe: -986.164884 hartree
dipole: -3.0775 -4.6481 1.6089
dipole: 5.8021
quadrupole: -108.2683 -116.1066 -103.1159
quadrupole: -9.8006 -8.4953 -2.5343
quadrupole: 0.8953 -6.9430 6.0477 -9.8006 -8.4953 -2.5343
hfenergy: -986.3517689 hartree
pointgroup: C01 [X(C10H12F1N5O3)]
dipole: 1.1277011 -1.8622607 -0.6863191 debye
polarizability: 207.3764271|-2.183381|152.3418463|-12.0746929|-8.0780153|94.8521568 unknown
InChI: InChI=1S/C10H12FN5O3/c11-10-14-8(12)7-9(15-10)16(3-13-7)6-1-4(18)5(2-17)19-6/h3-6,17-18H,1-2,12H2
charge 0 multiplicity 1
31 atoms
F  -3.481315 2.95455 -0.239903
O  2.113871 0.834659 0.595136
O  3.025078 -2.161987 -0.768604
O  4.802459 1.686996 0.155925
N  0.10386 -0.201106 -0.32666
N  -1.223809 -1.994031 0.229638
N  -1.61965 1.588904 -0.324376
N  -3.84823 0.724693 0.226141
N  -4.272463 -1.54744 0.701126
C  1.279319 0.644356 -0.601087
C  3.316605 -0.71619 -0.862815
C  2.250751 0.080581 -1.662591
C  3.224968 -0.164095 0.584285
C  4.475966 0.580555 1.061021
C  -1.19204 0.301413 -0.169001
C  0.023292 -1.588995 -0.068638
C  -1.996561 -0.817785 0.167228
C  -3.385777 -0.563086 0.370284
C  -2.946391 1.672046 -0.10377
H  0.867808 1.636141 -0.848944
H  4.323833 -0.558043 -1.289959
H  2.739372 0.932499 -2.165368
H  1.740202 -0.531488 -2.423944
H  2.980195 -1.000951 1.266615
H  5.348352 -0.093625 1.044466
H  4.319103 0.943272 2.09663
H  0.90685 -2.223348 -0.124683
H  3.24101 -2.600965 -1.62894
H  4.029723 2.309865 0.176784
H  -3.94383 -2.504105 0.81567
H  -5.252854 -1.309394 0.837131
