program: Gaussian 09
title: 000270925
version: EM64L-G09RevD.01
frameworkgroup: C1[X(C14H16N4)]
method: RPBEPBE
basis: SDD
operation: Freq
keyword: #pfreq=noraman
keyword: PBEPBE/SDD
title: #p freq=noraman PBEPBE/SDD
converged: YES YES NO NO
title: Mulliken charges:
elementType: N N N N C C C C C C C C C C C C C C H H H H H H H H H H H H H H H H
charge: -0.189234 -0.189234 -0.317600 -0.317600 -0.410961 -0.410962 0.412691 0.412690 -0.363267 -0.363267 -0.374249 -0.374248 -0.225030 -0.225029 -0.199596 -0.199596 -0.266565 -0.266566 0.249508 0.232036 0.249507 0.232036 0.293120 0.293120 0.232244 0.232244 0.263596 0.263597 0.219199 0.219198 0.219316 0.219316 0.224791 0.224792
chargesum: 0.00000
title: Mulliken charges with hydrogens summed into heavy atoms:
elementType: N N N N C C C C C C C C C C C C C C
charge: -0.189234 -0.189234 -0.024479 -0.024480 0.070582 0.070582 0.412691 0.412690 -0.131023 -0.131023 -0.110653 -0.110651 -0.005831 -0.005831 0.019720 0.019720 -0.041773 -0.041774
polarizability: 2.32673789e+02 -8.66552823e+00 1.69521622e+02 -6.68849783e-04 2.28108375e-03 1.33270399e+02
1716.lowfreq: -10.2476 -8.2964 -0.0006 -0.0003 0.0001 12.5642 20.2411 48.8807 53.3737
frequency: 20.0813 48.8701 53.3732 87.5987 138.1215 161.8497 162.2344 210.1885 235.6086 278.1884 333.5438 368.2184 408.7736 410.4395 412.2396 448.7871 486.2694 501.1825 509.8673 527.0621 595.1524 606.7175 613.9853 615.1363 668.0357 679.0723 695.9161 696.8019 752.0041 756.0162 761.5549 766.7069 826.4606 827.8573 890.2226 890.6907 941.4268 958.7656 963.2149 963.7780 978.6148 978.6920 983.6495 984.2302 991.7413 1019.3705 1025.8687 1026.5378 1081.8971 1085.9399 1096.1709 1126.4392 1136.8145 1157.6679 1167.0330 1167.2172 1185.0777 1185.8764 1235.4955 1241.7159 1297.6365 1310.4172 1318.6852 1321.8433 1345.2501 1357.7297 1385.6959 1388.4513 1445.2738 1445.3785 1453.9976 1457.3859 1471.5067 1475.4779 1492.3494 1494.5626 1582.8799 1583.2521 1616.1252 1619.1680 2958.4061 2960.5916 3024.4700 3026.9445 3122.1709 3122.2515 3129.6556 3129.6789 3149.3827 3149.4028 3162.0004 3162.0148 3174.2990 3174.3130 3450.0547 3454.7841
redmass: 5.5749 4.2017 3.6463 4.3542 3.0278 4.5571 3.4057 3.4447 4.6111 6.7541 2.7292 3.3735 4.8338 2.9838 3.2645 3.0422 3.1633 3.1774 2.8610 5.6069 6.4381 1.5835 6.2389 6.4528 1.8693 6.6823 1.9515 1.9617 2.4469 1.7506 2.0484 2.5868 1.2603 1.2654 1.4412 1.4477 3.8863 4.8303 1.3492 1.4678 5.6048 5.7622 1.3476 1.3012 2.3071 2.7430 2.0761 2.0152 1.5654 1.6310 2.2932 2.2121 3.4202 3.0061 1.0564 1.0940 1.1167 1.1115 1.3042 1.2139 3.0796 2.1175 1.3806 1.7908 1.3258 1.4436 6.1439 4.5710 2.4715 2.4582 1.2213 1.2507 1.1161 1.1861 2.0947 1.9760 6.4086 6.3804 6.1470 6.1061 1.0599 1.0600 1.1052 1.1061 1.0844 1.0845 1.0890 1.0890 1.0927 1.0927 1.0973 1.0973 1.0964 1.0964 1.0769 1.0764
irintensity: 0.0975 0.0290 0.3795 0.2053 21.5799 0.1095 0.0544 4.6268 1.3920 6.6488 12.2741 0.0287 0.0279 0.0002 0.3386 15.7967 0.5618 16.7523 29.2520 0.1585 0.0252 346.5788 3.5165 0.0025 21.3111 39.9225 26.4377 41.3109 48.7205 67.4719 78.9173 5.7016 0.0512 0.0765 8.6609 13.9628 4.0186 7.2848 0.1398 0.4443 1.4295 6.2537 1.3000 1.8659 0.7878 16.9994 33.8239 5.7007 0.6989 19.1564 46.2005 0.0006 116.3732 0.0297 0.6317 1.1270 5.0263 7.9603 0.0118 4.4517 45.3243 64.6655 4.4762 62.4488 9.0546 53.8201 0.3903 24.4612 4.8532 0.3683 7.6057 24.9191 42.3651 32.2183 144.7835 26.8259 1.3233 13.5884 223.0921 55.1153 59.8258 6.1498 34.2229 33.0898 10.6431 1.9704 2.9716 26.1500 7.2531 73.0664 12.2591 31.9524 12.0294 0.7883 6.1696 0.6864
temp: 298.150 k
press: 1.00000 atm
elementType: 7 7 7 7 6 6 6 6 6 6 6 6 6 6 6 6 6 6 1 1 1 1 1 1 1 1 1 1 1 1 1 1 1 1
symmnumber: 1
zpe: 731765.0 jmol-1
zpe.correction: 0.278715 hartree
zpe.thermalcorrener: 0.293611 hartree
zpe.thermalcorrenthalpy: 0.294555 hartree
zpe.thermalcorrgfe: 0.235507 hartree
zpe.sumelectzpe: -760.712765 hartree
zpe.sumelectthermal: -760.697868 hartree
zpe.sumelectthermalent: -760.696924 hartree
zpe.sumelectthermalfe: -760.755972 hartree
dipole: 0.0000 -0.0001 1.9069
dipole: 1.9069
quadrupole: -116.4155 -96.1908 -101.3743
quadrupole: 0.7552 0.0000 0.0003
quadrupole: -11.7553 8.4694 3.2859 0.7552 0.0000 0.0003
hfenergy: -760.9914791 hartree
pointgroup: C01 [X(C14H16N4)]
dipole: -0.0000018 -0.0000488 -0.7502259 debye
polarizability: 232.5784949|9.0055734|169.6169167|-0.0006565|-0.0022847|133.2703995 unknown
InChI: InChI=1S/C14H16N4/c1-3-7-13(8-4-1)17-11-16-18(12-15-17)14-9-5-2-6-10-14/h1-10,15-16H,11-12H2
charge 0 multiplicity 1
34 atoms
N  1.418946 -0.19397 -1.126896
N  -1.418963 0.193831 -1.126927
N  0.828299 1.015805 -1.600812
N  -0.828314 -1.016006 -1.600683
C  0.447713 -1.343678 -0.969255
C  -0.44773 1.34356 -0.969433
C  2.547967 -0.092946 -0.274977
C  -2.547981 0.092915 -0.274989
C  3.034729 -1.251781 0.399446
C  -3.03474 1.251832 0.399293
C  3.241386 1.139886 -0.11159
C  -3.241399 -1.139898 -0.111447
C  4.182707 -1.167025 1.216427
C  -4.182715 1.167177 1.216289
C  4.38557 1.205833 0.707979
C  -4.385579 -1.205744 0.708135
C  4.868786 0.057331 1.38058
C  -4.868793 -0.057159 1.380597
H  0.281172 -1.547916 0.108223
H  0.849229 -2.257938 -1.445743
H  -0.281191 1.547938 0.10802
H  -0.849244 2.257758 -1.446041
H  0.821302 1.05913 -2.626827
H  -0.821312 -1.059466 -2.626692
H  2.536502 -2.219464 0.282047
H  -2.536515 2.219501 0.281772
H  2.863274 2.024296 -0.63117
H  -2.863289 -2.024372 -0.630919
H  4.541575 -2.0691 1.725801
H  -4.54158 2.069316 1.725554
H  4.904169 2.165005 0.823398
H  -4.904178 -2.164901 0.823675
H  5.759055 0.116024 2.015418
H  -5.759058 -0.115774 2.015446
