program: Gaussian 09
title: 000270922
version: EM64L-G09RevD.01
frameworkgroup: C1[X(C11H10Cl2N2)]
method: RPBEPBE
basis: SDD
operation: Freq
keyword: #p
keyword: freq=noraman
keyword: PBEPBE/SDD
title: #p freq=noraman PBEPBE/SDD
converged: NO YES NO NO
title: Mulliken charges:
elementType: Cl Cl N N C C C C C C C C C C C H H H H H H H H H H
charge: -0.038203 -0.067996 -0.089190 -0.046357 -0.124464 0.115551 0.231984 -0.634294 -0.634608 0.342157 -0.363045 -0.385142 -0.456517 -0.250086 -0.221742 0.250834 0.275825 0.286728 0.261345 0.330026 0.236216 0.244989 0.257940 0.237418 0.240633
chargesum: 0.00000
title: Mulliken charges with hydrogens summed into heavy atoms:
elementType: Cl Cl N N C C C C C C C C C C C
charge: -0.038203 -0.067996 -0.089190 -0.046357 0.126370 0.115551 0.231984 -0.071741 -0.043237 0.342157 -0.126829 -0.140154 -0.198577 -0.012668 0.018890
polarizability: 1.80140811e+02 4.45501365e-01 1.03305546e+02 1.18765571e+01 -6.55671467e+00 1.51978313e+02
1716.lowfreq: -11.4736 -0.0013 0.0009 0.0028 3.8757 7.4974 30.1629 47.6935 58.4292
frequency: 30.1437 47.6203 58.4074 87.6595 112.5989 161.3543 170.2250 203.2607 233.5155 285.4284 344.2402 397.7423 437.3104 440.0910 458.2656 497.8869 540.3177 567.1694 602.3745 631.1297 663.1069 684.8935 747.3790 767.2633 793.7319 807.1677 860.3196 875.9040 885.0287 910.4305 919.5603 949.3309 972.7106 978.1227 1003.9618 1027.8141 1054.7775 1087.5367 1144.2511 1151.0348 1175.9986 1195.4563 1210.2016 1239.9840 1256.5148 1266.6014 1281.2060 1305.0862 1320.9540 1341.8387 1386.0026 1405.6064 1419.6074 1423.9856 1448.0968 1484.4174 1513.8942 1565.8540 1621.4236 2975.5296 3049.4506 3069.7902 3130.6031 3130.9196 3132.6468 3139.5346 3154.0878 3169.2676 3170.3772
redmass: 9.7042 7.8400 10.5146 6.1657 6.6457 4.5570 5.6286 5.3449 3.9501 2.8643 4.0425 4.1171 4.5046 4.6597 4.2961 5.8582 7.3434 4.3655 4.7162 5.1530 4.5745 5.4318 3.1450 1.4709 7.3140 3.2048 4.4636 1.4618 1.5934 2.0476 1.8158 4.2175 1.4382 3.4328 1.3535 2.2574 2.6332 1.8106 1.3947 1.2769 1.1221 1.4548 1.2479 1.6899 2.8946 1.8049 1.2550 1.6052 1.4014 3.0303 2.2667 2.0006 4.0556 1.2844 1.1042 2.8096 5.0213 6.7600 6.2724 1.0810 1.0568 1.0585 1.0914 1.1097 1.0874 1.0890 1.0953 1.1007 1.1092
irintensity: 0.6163 0.1587 2.6565 2.3912 0.2324 0.6702 1.3123 0.6652 2.9968 5.6964 7.4463 2.6010 3.8862 1.8902 16.9412 10.1525 2.2529 6.7884 3.2218 7.8473 2.5233 5.7022 71.0080 35.6803 2.6863 4.8937 0.2949 2.2089 7.6497 18.1165 13.5995 16.2360 2.5080 4.6430 0.2308 3.9931 3.6511 1.3462 1.0562 11.4193 4.4458 4.5323 2.1186 7.4936 14.2729 0.5252 20.5549 28.2237 5.2304 4.2632 4.1779 0.0141 1.1071 47.2178 13.5121 5.8499 9.4330 5.2549 2.0093 4.4144 19.6587 27.4896 7.7244 18.3340 0.9487 2.8290 25.0336 19.7250 0.7881
temp: 298.150 k
press: 1.00000 atm
elementType: 17 17 7 7 6 6 6 6 6 6 6 6 6 6 6 1 1 1 1 1 1 1 1 1 1
symmnumber: 1
zpe: 487932.9 jmol-1
zpe.correction: 0.185844 hartree
zpe.thermalcorrener: 0.199150 hartree
zpe.thermalcorrenthalpy: 0.200094 hartree
zpe.thermalcorrgfe: 0.143746 hartree
zpe.sumelectzpe: -1453.689045 hartree
zpe.sumelectthermal: -1453.675738 hartree
zpe.sumelectthermalent: -1453.674794 hartree
zpe.sumelectthermalfe: -1453.731142 hartree
dipole: -4.8735 1.8871 -5.0219
dipole: 7.2479
quadrupole: -86.2752 -113.1504 -100.6018
quadrupole: 3.4888 -4.8615 -3.5837
quadrupole: 13.7340 -13.1413 -0.5927 3.4888 -4.8615 -3.5837
hfenergy: -1453.8748885 hartree
pointgroup: C01 [X(C11H10Cl2N2)]
dipole: 2.0037161 2.0198965 -0.1906918 debye
dipolederiv: -0.250023 -0.0284664 -0.1152991 -0.0658463 -0.1800212 -0.1033588 -0.1746729 -0.0333391 -0.4316473 -0.2332018 -0.0074389 0.0197858 -0.0149792 -0.1740452 0.0561981 0.1222832 0.0899185 -0.5631827 -0.0828697 -0.1768706 -0.0297237 0.2581997 -0.2955382 -0.0194649 0.0444899 -0.0049412 -0.1709785 -0.2638801 0.1604535 0.0184312 -0.1909172 -0.0470693 0.0459514 -0.0221596 0.0138381 -0.2181273 -0.0006672 -0.0003323 -0.1241894 -0.0411126 -0.0499487 -0.0215438 -0.1070097 0.0842441 -0.1538859 0.4209031 -0.0986116 0.0366287 -0.3732995 0.1542753 0.0100137 -0.0314858 0.0235119 0.0249505 -0.2288254 0.0872452 0.0281142 0.2199194 0.0086231 -0.0237408 0.0505144 -0.0102224 0.0509308 0.1822731 0.0588864 0.2600157 0.1259169 0.2425474 0.185717 0.3574202 0.0837738 0.5554501 0.1705923 -0.0316427 -0.0374245 0.0789212 0.1131234 -0.1266332 -0.1130645 -0.1103217 0.7247017 0.0342044 0.1332299 0.0296081 -0.006496 -0.1638835 -0.0442124 0.0012747 -0.0541127 0.0930158 -0.0655157 -0.1338877 -0.0217859 -0.1095059 -0.0187515 0.0166441 -0.0397662 0.0386868 -0.1374719 -0.000523 -0.0902288 -0.0228737 -0.1760506 0.0300084 0.0383256 -0.0365008 0.0291723 -0.1465811 0.0955235 -0.1266108 -0.0159179 0.0386461 0.2430151 0.0479765 -0.0011322 0.0500003 0.0013611 -0.0354577 0.0553395 0.0011691 0.0309943 0.1620105 0.0516003 0.0028352 0.0445573 -0.1299363 0.1644516 0.0109874 -0.0169638 0.0602343 -0.0763165 0.0047574 -0.0095518 0.0077397 -0.135813 0.0471478 -0.0530341 -0.0468706 0.0216683 -0.0268718 -0.0082008 -0.0632493 -0.0707239 0.0052767 -0.036616 0.093967 -0.0472572 0.0897871 -0.0531808 -0.0585763 -0.0594175 -0.061636 0.0063043 -0.0361509 -0.1067158 0.0357771 -0.1081915 0.0452923 -0.0085313 0.0418773 -0.0290378 -0.0389683 -0.0561464 0.0776172 -0.0074467 0.1322707 0.0114953 0.0354796 -0.0016585 0.0417213 -0.0351776 0.2091159 -0.0075388 -0.0200154 -0.1042474 0.0560626 0.0327212 -0.0356133 -0.0134138 -0.0188558 0.0136546 0.1130691 0.0287408 0.0910592 0.0014478 -0.0172363 0.0260788 -0.0274889 0.1333395 0.0142472 0.0468958 0.0149611 0.1095382 -0.0104651 -0.0311696 0.0258148 -0.027917 0.15092 -0.0250704 0.1228417 0.0281143 0.050002 0.0209977 -0.0198147 0.0180064 -0.0224066 0.1234218 0.0671233 -0.0552301 -0.0036902 -0.068221 -0.0796766 -0.0345877 -0.0037068 -0.035033 0.1517516 -0.1042895 -0.0439241 0.0081121 -0.0482902 0.0868694 -0.0083142 0.0083941 -0.00657 0.1592017 unknown
polarizability: 181.3648024|10.25518|150.0839001|0.2849655|8.6246216|103.9759679 unknown
InChI: InChI=1S/C11H10Cl2N2/c12-5-9(6-13)11-10-4-2-1-3-8(10)7-14-15-11/h1-4,7,9H,5-6H2
charge 0 multiplicity 1
25 atoms
Cl -2.79725 0.53218 -2.383167
Cl -2.904477 -0.016684 2.682327
N  -1.049733 -1.441392 -0.041669
N  -0.107897 -2.462355 -0.249107
C  -1.77488 0.867896 0.268653
C  -0.649954 -0.158533 0.113344
C  0.741088 0.245851 0.094746
C  -2.038035 1.631716 -1.051771
C  -3.073267 0.258371 0.818549
C  1.708099 -0.801303 -0.122099
C  1.209869 1.586111 0.278153
C  3.103237 -0.495168 -0.157722
C  1.198984 -2.132946 -0.290327
C  2.580504 1.865378 0.239102
C  3.533494 0.823181 0.017421
H  -1.445853 1.651171 0.983127
H  -2.76519 2.444681 -0.900715
H  -1.109031 2.022084 -1.493314
H  -3.928461 0.940316 0.703069
H  -3.266839 -0.732175 0.38956
H  0.50271 2.400879 0.463555
H  3.824673 -1.303865 -0.32147
H  1.880481 -2.974579 -0.462776
H  2.931794 2.892731 0.383602
H  4.601435 1.064053 -0.009269
