program: Gaussian 09
title: 000270914
version: EM64L-G09RevD.01
frameworkgroup: C1[X(C15H15N3O2)]
method: RPBEPBE
basis: SDD
operation: Freq
keyword: #p
keyword: freq=noraman
keyword: PBEPBE/SDD
title: #p freq=noraman PBEPBE/SDD
converged: YES YES NO NO
title: Mulliken charges:
elementType: O O N N N C C C C C C C C C C C C C C C H H H H H H H H H H H H H H H
charge: -0.333637 -0.297057 -0.376824 -0.408134 -0.005677 -0.439058 -0.286226 0.223840 0.267196 0.187075 0.267793 -0.341934 -0.359182 -0.283631 -0.300335 -0.218165 -0.231553 -0.221145 -0.334098 -0.353130 0.219433 0.256095 0.228023 0.245653 0.316071 0.373542 0.271449 0.219972 0.274110 0.249532 0.238057 0.234081 0.237698 0.241222 0.238944
chargesum: 0.00000
title: Mulliken charges with hydrogens summed into heavy atoms:
elementType: O O N N N C C C C C C C C C C C C C C C
charge: -0.333637 -0.297057 -0.060753 -0.034591 -0.005677 0.036470 0.187450 0.223840 0.267196 0.187075 0.267793 -0.070484 -0.139210 -0.009521 -0.050803 0.019892 0.002527 0.016553 -0.092876 -0.114186
polarizability: 2.51310392e+02 -1.06707718e+00 2.11500354e+02 4.93179805e-01 -6.70364132e+00 9.84325343e+01
1716.lowfreq: -2.3852 -0.0007 -0.0004 0.0004 3.2902 7.7312 11.5297 32.0144 37.5032
frequency: 11.2850 31.9482 37.4934 44.8294 76.8624 81.6466 104.1267 130.7929 158.7698 179.8996 213.3837 254.3123 275.3060 303.5601 337.4579 362.2790 369.0792 402.2708 419.7793 459.5259 463.5181 480.4101 519.4746 549.6780 614.6438 655.3234 657.9685 660.6622 688.0399 694.2161 702.7985 751.0329 777.8067 782.5480 793.9455 827.3234 847.7279 854.6025 883.4017 899.8027 923.1127 938.6567 960.4502 972.9491 985.0345 989.9970 994.7632 1007.2291 1017.6688 1040.0233 1059.7714 1078.7474 1085.3206 1090.5037 1094.9990 1149.1065 1173.2753 1175.9183 1191.3266 1220.1846 1224.6912 1263.4356 1291.7726 1301.1356 1314.4016 1317.2678 1333.8331 1352.1277 1364.4370 1386.4161 1400.1693 1432.4866 1446.3563 1462.7116 1469.6469 1477.0270 1505.1739 1524.3109 1542.2586 1568.8362 1586.5199 1595.5002 1602.5226 1611.2098 2974.8689 3010.4163 3032.6492 3081.1412 3120.0445 3128.7195 3135.8726 3136.4618 3149.1057 3152.3702 3161.7540 3170.7125 3173.3295 3319.3507 3559.4885
redmass: 5.5345 4.0061 4.4492 6.7794 4.9250 5.0890 5.3793 4.7298 5.9802 4.9314 3.9476 6.6848 6.2889 2.5889 5.4137 4.5588 2.4909 2.7856 4.2878 4.7621 4.4953 4.3869 2.7246 1.2593 6.2957 5.0534 7.2203 6.9859 4.5009 3.8885 1.5642 2.0892 2.2615 1.6931 2.3773 3.9233 1.5735 1.2576 3.0589 1.2642 2.5541 1.5027 6.8089 1.4251 1.4720 4.8559 1.4115 1.3449 3.1238 2.2791 2.1184 2.5440 1.7090 1.9867 2.3578 2.8230 3.3815 1.0675 1.1328 1.1814 1.2823 1.3373 2.1740 6.2530 1.8615 1.3531 1.4394 1.6199 1.2817 9.2378 1.8966 2.0530 1.1998 1.8791 1.5318 1.3394 2.0993 2.2167 7.6343 3.9563 4.9998 6.7228 4.6157 6.0319 1.0627 1.0651 1.0953 1.1036 1.0878 1.0878 1.0900 1.0871 1.0920 1.0972 1.0958 1.0960 1.1008 1.0839 1.0777
irintensity: 0.6225 0.1160 0.2528 1.7333 3.4395 4.5850 3.9356 3.7587 9.4889 6.9738 8.5715 8.4930 11.3226 4.7434 0.6820 1.5094 0.1553 0.6732 18.0782 10.5654 2.8976 2.0089 10.9111 92.7680 0.8573 12.0471 19.5650 0.4817 10.6181 25.2721 107.0121 0.4126 52.8023 58.8493 8.4095 4.8471 65.0379 2.5620 10.0149 0.1672 2.3252 3.5510 6.3406 3.0177 1.7789 0.9876 1.0777 1.0283 2.7503 12.3731 9.1900 1.2847 6.7721 9.9798 12.2705 14.8715 10.7327 1.6576 10.6234 21.2160 1.7002 7.2311 155.2863 1.5496 51.9770 2.9471 8.2923 27.6772 7.5212 2.9445 7.0579 5.5151 34.1246 52.3697 105.2786 6.5531 172.1687 707.1211 83.9730 21.4610 14.4528 58.2848 18.8384 12.3067 34.0737 14.5506 42.0986 18.2257 8.9369 14.4517 22.0768 1.1640 16.8053 9.6580 16.3411 8.5433 18.0418 566.0968 18.9174
temp: 298.150 k
press: 1.00000 atm
elementType: 8 8 7 7 7 6 6 6 6 6 6 6 6 6 6 6 6 6 6 6 1 1 1 1 1 1 1 1 1 1 1 1 1 1 1
symmnumber: 1
zpe: 724871.8 jmol-1
zpe.correction: 0.276089 hartree
zpe.thermalcorrener: 0.293632 hartree
zpe.thermalcorrenthalpy: 0.294576 hartree
zpe.thermalcorrgfe: 0.227275 hartree
zpe.sumelectzpe: -893.901501 hartree
zpe.sumelectthermal: -893.883959 hartree
zpe.sumelectthermalent: -893.883015 hartree
zpe.sumelectthermalfe: -893.950315 hartree
dipole: -8.7941 2.4110 -0.1060
dipole: 9.1193
quadrupole: -112.6103 -111.4814 -122.6588
quadrupole: -1.4217 5.6068 5.9095
quadrupole: 2.9732 4.1021 -7.0753 -1.4217 5.6068 5.9095
hfenergy: -894.1775904 hartree
pointgroup: C01 [X(C15H15N3O2)]
dipole: -3.4520708 -0.9677504 0.137575 debye
polarizability: 251.2418653|1.1169843|210.7313608|-2.894798|-11.5528796|99.2700542 unknown
InChI: InChI=1S/C15H15N3O2/c19-14(12-4-2-1-3-5-12)17-10-11-18-15(20)13-6-8-16-9-7-13/h1-9,17-18H,10-11H2
charge 0 multiplicity 1
35 atoms
O  -0.849158 -0.008348 -0.903907
O  3.280719 -2.180252 1.136712
N  -1.759763 -1.944802 -0.000753
N  1.326934 -1.479037 0.101555
N  4.537252 2.568927 -0.284723
C  -0.666309 -2.833772 -0.45595
C  0.637031 -2.748346 0.364911
C  -1.823936 -0.602325 -0.319707
C  -3.076477 0.134412 0.05958
C  2.620215 -1.277968 0.521069
C  3.230507 0.073369 0.213276
C  -2.998027 1.545672 0.179757
C  -4.321125 -0.514759 0.277364
C  4.57799 0.284322 0.595198
C  2.54603 1.141565 -0.423264
C  -4.137647 2.294641 0.537078
C  -5.462185 0.237054 0.631484
C  -5.371622 1.641921 0.7689
C  5.183549 1.530684 0.329591
C  3.23681 2.354399 -0.646803
H  -1.047147 -3.869152 -0.413874
H  -0.446375 -2.592831 -1.512685
H  0.423651 -2.863504 1.44698
H  1.304179 -3.58714 0.086895
H  -2.488176 -2.342628 0.593215
H  0.770184 -0.755608 -0.383531
H  -2.036685 2.031298 -0.015624
H  -4.424285 -1.597166 0.131809
H  5.118556 -0.527836 1.090511
H  1.501909 1.064728 -0.745703
H  -4.066611 3.383178 0.633652
H  -6.420995 -0.268507 0.788479
H  -6.258029 2.223547 1.044613
H  6.224644 1.720622 0.61358
H  2.735391 3.196542 -1.137385
