program: Gaussian 09
title: 000270902
version: EM64L-G09RevD.01
frameworkgroup: C1[X(C8H5BrN2O)]
method: RPBEPBE
basis: SDD
operation: Freq
keyword: #p
keyword: freq=noraman
keyword: PBEPBE/SDD
title: #p freq=noraman PBEPBE/SDD
converged: NO YES NO YES
title: Mulliken charges:
elementType: Br O N N C C C C C C C C H H H H H
charge: 0.034029 -0.236931 -0.462700 0.058857 0.160039 0.391354 -0.281921 -0.375020 0.115422 -0.244541 -0.140589 -0.424002 0.300079 0.240100 0.337263 0.257435 0.271127
chargesum: 0.00000
title: Mulliken charges with hydrogens summed into heavy atoms:
elementType: Br O N N C C C C C C C C
charge: 0.034029 -0.236931 -0.125438 0.058857 0.160039 0.391354 0.018159 -0.134920 0.115422 -0.244541 0.116846 -0.152876
polarizability: 1.89137329e+02 -5.24887599e+00 1.31894123e+02 -1.37794795e-02 1.17353960e-02 4.34751318e+01
1716.lowfreq: -0.0009 -0.0006 0.0004 5.2773 5.2888 10.4427 74.3723 142.2561 149.2411
frequency: 74.3712 142.2548 149.2404 169.2560 254.2353 295.2590 312.3779 405.7732 481.8901 497.4407 516.4777 537.5908 543.3093 594.0538 654.5077 679.5234 704.9060 765.1373 810.5544 815.3366 886.3906 888.0236 933.7094 960.3119 1051.5813 1063.2264 1087.2644 1148.5389 1244.2489 1247.8154 1280.0326 1321.5724 1376.6261 1408.3025 1447.8591 1459.2866 1525.5068 1563.4007 1586.7758 1607.0439 3137.5787 3168.6193 3173.4646 3174.2577 3569.2836
redmass: 8.4896 12.6468 6.3860 4.0811 14.7922 6.7421 6.8916 3.5624 5.5780 9.1737 6.7655 7.0805 4.1113 8.8125 1.1624 4.2124 7.1849 3.3074 6.6633 1.4739 5.8645 1.4563 1.4161 1.3570 2.8429 3.3015 4.2494 1.3421 1.6567 2.9679 1.9267 1.7622 3.5441 5.1930 4.8379 2.4448 3.4924 4.5333 6.1812 6.4882 1.0899 1.0928 1.0926 1.0960 1.0790
irintensity: 0.3442 1.9424 0.2051 0.1361 4.3502 0.3070 3.8005 2.6890 0.4857 21.4296 3.7147 11.5166 13.7932 15.7698 99.4312 3.2346 0.9534 0.5751 13.5617 56.3103 11.6430 31.6443 7.8548 2.3134 24.3367 22.3850 35.0355 14.3329 0.1204 11.1962 2.4806 31.9021 9.9743 10.0131 173.2408 40.8458 8.6682 174.6338 102.6696 1.0092 5.7608 4.2496 2.5141 4.1818 73.1546
temp: 298.150 k
press: 1.00000 atm
elementType: 35 8 7 7 6 6 6 6 6 6 6 6 1 1 1 1 1
symmnumber: 1
zpe: 303338.4 jmol-1
zpe.correction: 0.115535 hartree
zpe.thermalcorrener: 0.124916 hartree
zpe.thermalcorrenthalpy: 0.125860 hartree
zpe.thermalcorrgfe: 0.079456 hartree
zpe.sumelectzpe: -505.191976 hartree
zpe.sumelectthermal: -505.182596 hartree
zpe.sumelectthermalent: -505.181652 hartree
zpe.sumelectthermalfe: -505.228056 hartree
dipole: -0.0583 -5.6857 -0.0005
dipole: 5.6860
quadrupole: -81.1263 -75.1092 -80.4439
quadrupole: 8.2082 0.0001 0.0001
quadrupole: -2.2332 3.7839 -1.5507 8.2082 0.0001 0.0001
hfenergy: -505.307512 hartree
pointgroup: C01 [X(C8H5Br1N2O1)]
dipole: 0.2942283 2.2176167 0.0001935 debye
dipolederiv: -0.7174602 0.1863932 -0.0000567 0.2948225 -0.1207447 0.0000212 -0.000044 0.0000097 -0.0176398 -0.3983819 0.0251247 -0.000003 -0.342562 -1.1117004 -0.0001751 -0.0000395 -0.0000564 -0.3650679 -0.8885443 -0.2792217 -0.0000861 0.0507719 -0.4329715 -0.0000141 -0.000086 -0.0000253 -0.2366393 0.1878807 0.5339908 0.000081 0.6185919 0.4429412 0.0000863 0.0000677 0.0000983 -0.1464728 -0.2681594 -0.3735741 -0.0000836 -0.2061169 -0.2490515 -0.0000574 -0.0000559 -0.0000574 -0.0194764 0.6165551 -0.2476169 0.0000148 -0.2280812 0.0521543 -0.0000138 0.0000281 -0.0000379 0.1178047 -0.3596576 0.2397842 0. 0.004354 -0.0037608 0.000006 -0.0000446 0.0000302 -0.0382993 -0.1806484 0.1313734 0.0000213 0.0190797 0.1143238 0.000033 0.000011 0.0000405 -0.1681218 0.4301891 -0.0588746 0.0000137 0.468835 1.2035949 0.0002203 0.000071 0.0000908 0.2360084 1.2168795 -0.547543 0.0000896 -0.5752345 -0.014009 -0.0000554 0.0000896 -0.0000533 -0.1510634 -0.2207079 0.0774132 -0.0000117 0.1939688 0.1501159 0.0000513 0.0000021 0.0000371 -0.0659882 0.2369811 0.4687143 0.0001107 -0.2272681 -0.366823 -0.0000163 0.0001201 0.0000524 -0.1092542 0.129279 -0.026234 -0.0000057 0.0606097 0.0534085 -0.0000059 0.000006 -0.000014 0.1550467 0.0503846 0.0710395 -0.0000063 0.0242279 -0.0769275 -0.0000264 -0.0000069 -0.0000218 0.1753044 0.1640665 -0.0897666 -0.0000229 -0.0410711 0.236022 -0.0000151 -0.000014 -0.0000258 0.3277755 0.0049194 -0.0774619 -0.0000263 -0.0622992 0.0650774 -0.0000176 -0.0000255 -0.0000171 0.1560155 -0.003575 -0.0335405 -0.000029 -0.0526284 0.0583503 -0.0000209 -0.0000792 -0.00005 0.1500678 unknown
polarizability: 189.4605629|-2.990531|131.5708893|0.0153032|0.0096647|43.4751318 unknown
InChI: InChI=1S/C8H5BrN2O/c9-5-1-2-7-6(3-5)8(12)4-10-11-7/h1-4,11H
charge 0 multiplicity 1
17 atoms
Br 4.03156 -0.948221 0.000288
O  -1.379551 -2.514322 -0.000493
N  -1.592492 1.579514 -0.000054
N  -2.763884 0.864594 -0.000223
C  -0.181228 -0.393769 -0.000141
C  -0.30824 1.0290 0.000018
C  1.111424 -0.980636 -0.000055
C  0.850062 1.855571 0.000248
C  -1.40387 -1.239191 -0.000412
C  2.239679 -0.1540 0.000179
C  2.121794 1.263672 0.00033
C  -2.661427 -0.468512 -0.000338
H  1.177759 -2.072713 -0.000184
H  0.755876 2.947482 0.000361
H  -1.727418 2.590679 0.000039
H  3.018813 1.889148 0.000505
H  -3.610959 -1.012096 -0.000669
