program: Gaussian 09
title: 000270901
version: EM64L-G09RevD.01
frameworkgroup: C1[X(C4H5N3O)]
method: RPBEPBE
basis: SDD
operation: Freq
keyword: #pfreq=noraman
keyword: PBEPBE/SDD
title: #p freq=noraman PBEPBE/SDD
converged: NO NO NO NO
title: Mulliken charges:
elementType: O N N N C C C C H H H H H
charge: -0.290778 -0.409886 0.057804 -0.658813 0.438999 -0.420691 0.219259 -0.418170 0.252423 0.241512 0.350959 0.322371 0.315010
chargesum: 0.00000
title: Mulliken charges with hydrogens summed into heavy atoms:
elementType: O N N N C C C C
charge: -0.290778 -0.058926 0.057804 -0.021432 0.438999 -0.168268 0.219259 -0.176658
polarizability: 1.02147503e+02 3.55916098e+00 6.99428479e+01 -3.26992830e-03 4.23278023e-03 2.90865585e+01
1716.lowfreq: -10.3471 -4.5470 -0.0007 -0.0006 -0.0006 10.5603 174.2798 193.1282 322.9097
frequency: 174.2791 193.1280 322.9097 402.8613 429.1670 459.7458 465.9893 504.5142 541.4449 649.2929 700.4378 717.0419 742.1245 831.4612 835.8251 919.4370 981.3244 1042.3706 1114.3302 1226.8827 1261.4446 1333.9569 1384.2129 1441.9452 1512.0885 1590.0000 1648.0703 1659.2074 3152.2735 3167.4420 3528.1096 3556.4878 3695.3576
redmass: 5.4083 3.9015 3.8468 1.0793 2.6119 4.3425 1.4547 6.8129 8.8365 3.5889 2.7744 9.5992 1.3644 1.3588 1.7286 3.1497 4.0136 1.4475 3.4669 2.8678 2.2943 1.4037 1.8762 3.1395 5.7511 4.0889 1.2685 5.8716 1.0919 1.0928 1.0791 1.0454 1.1043
irintensity: 1.6384 5.2519 2.5391 101.6341 70.4517 9.5285 138.6005 2.1868 7.3798 9.9712 8.4299 11.3980 117.9963 9.1553 59.5075 13.5143 5.5491 0.8047 23.6312 41.6421 65.2874 14.2068 4.7445 20.3355 17.2312 42.3047 230.4170 556.3955 7.3521 4.1707 58.1487 74.6088 28.9015
temp: 298.150 k
press: 1.00000 atm
elementType: 8 7 7 7 6 6 6 6 1 1 1 1 1
symmnumber: 1
zpe: 252323.3 jmol-1
zpe.correction: 0.096105 hartree
zpe.thermalcorrener: 0.102813 hartree
zpe.thermalcorrenthalpy: 0.103757 hartree
zpe.thermalcorrgfe: 0.065476 hartree
zpe.sumelectzpe: -394.306659 hartree
zpe.sumelectthermal: -394.299951 hartree
zpe.sumelectthermalent: -394.299007 hartree
zpe.sumelectthermalfe: -394.337288 hartree
dipole: 5.9530 0.2946 -0.0011
dipole: 5.9603
quadrupole: -40.6774 -46.3606 -49.0289
quadrupole: -9.6992 0.0008 0.0014
quadrupole: 4.6782 -1.0050 -3.6733 -9.6992 0.0008 0.0014
hfenergy: -394.4027639 hartree
pointgroup: C01 [X(C4H5N3O1)]
dipole: -2.3442509 -0.0571525 -0.0004256 debye
dipolederiv: -1.297649 -0.3739358 0.0004204 -0.380595 -0.6232779 0.0002615 -0.0009156 -0.000374 -0.396298 -0.5155284 0.1367329 -0.0000219 -0.625331 -0.4519537 -0.0002367 0.000205 0.0003582 -0.2799648 0.5069479 -0.1733882 0.0000613 0.2309977 -0.3442641 0.0000514 0.0001474 -0.0000204 -0.122166 -1.2999166 0.2644427 0.0000392 0.5403412 -0.2709562 -0.0000776 0.0002035 -0.0000788 -0.722911 1.533398 -0.2798093 -0.0001987 -0.35698 0.3512839 -0.0000378 0.0000039 0.0000802 0.2274246 -1.0413344 -0.0200786 0.0000054 -0.0673139 0.0105716 0.0000661 0.0001223 0.0000516 -0.2635525 1.6286283 0.3974984 -0.0003615 0.4658408 0.8968032 -0.0001868 0.0004297 -0.0001237 0.2463849 -0.1408536 0.1635828 -0.0000074 0.352014 -0.0342137 0.0000078 -0.0003118 -0.0000842 -0.1452247 0.0677326 0.0244655 0.0000572 0.0349242 -0.0521636 0.0000058 0.0000598 -0.0000406 0.1816132 -0.0533608 -0.0716268 0.0000101 -0.047472 0.0417546 0.0000173 0.0000441 0.0000555 0.1605897 0.1927406 -0.010512 -0.0000187 -0.0696557 0.1834869 0.0000759 0.0000704 0.0001093 0.3338492 0.17729 -0.0368108 0.0000087 -0.0767788 0.1473394 0.0000393 0.0000058 0.0000083 0.3869344 0.2419053 -0.0205609 0.000006 0.0000087 0.1455898 0.0000136 -0.0000645 0.0000585 0.393321 unknown
polarizability: 102.3056587|2.7475931|69.7846923|0.0031628|-0.0043134|29.0865585 unknown
InChI: InChI=1S/C4H5N3O/c5-3-1-4(8)7-6-2-3/h1-2,7H,5H2
charge 0 multiplicity 1
13 atoms
O  2.39058 1.037963 0.000301
N  1.191415 -0.968931 0.000108
N  0.076894 -1.755822 0.000313
N  -2.494003 0.88039 -0.00014
C  -1.224382 0.328314 -0.00023
C  -0.052503 1.095752 -0.000471
C  1.254449 0.470459 -0.000988
C  -1.099146 -1.121513 -0.000086
H  -0.077616 2.189437 -0.000351
H  -1.979262 -1.772443 0.000063
H  2.085089 -1.468968 0.000631
H  -2.622453 1.889091 -0.000232
H  -3.321962 0.290673 -0.000119
