program: Gaussian 09
title: 000270898
version: EM64L-G09RevD.01
frameworkgroup: C1[X(C8H5FN2O)]
method: RPBEPBE
basis: SDD
operation: Freq
keyword: #p
keyword: freq=noraman
keyword: PBEPBE/SDD
title: #p freq=noraman PBEPBE/SDD
converged: NO YES NO YES
title: Mulliken charges:
elementType: F O N N C C C C C C C C H H H H H
charge: -0.206057 -0.237343 -0.449633 0.062737 0.204213 0.200339 -0.372070 0.219688 0.114595 -0.198602 -0.334554 -0.422610 0.284966 0.355746 0.263390 0.244491 0.270706
chargesum: 0.00000
title: Mulliken charges with hydrogens summed into heavy atoms:
elementType: F O N N C C C C C C C C
charge: -0.206057 -0.237343 -0.093887 0.062737 0.204213 0.200339 -0.087104 0.219688 0.114595 0.045888 -0.071164 -0.151904
polarizability: 1.44851141e+02 -3.01529254e+00 1.19347849e+02 -1.09315196e-02 -8.14539309e-03 4.07247535e+01
1716.lowfreq: -8.2878 0.0004 0.0008 0.0009 5.9663 8.3826 95.9892 154.6980 208.8527
frequency: 95.9863 154.6957 208.8526 218.6065 273.5373 327.9043 433.5536 464.7899 480.6479 505.2422 523.6405 549.3964 576.2228 624.0046 679.2901 690.0529 746.6272 771.5725 807.7153 863.1463 890.1088 916.2854 923.0246 989.4740 1052.3766 1077.9616 1119.5674 1168.0149 1225.1963 1273.5015 1286.3926 1325.4542 1391.9642 1429.9188 1453.7211 1477.4950 1522.5223 1563.1966 1587.5544 1633.3084 3154.6159 3169.7376 3173.1410 3182.5566 3574.2573
redmass: 10.2709 4.7168 5.3698 9.8065 5.2823 9.5082 9.6058 7.0502 4.4584 7.9258 6.9459 6.7745 5.1724 9.2753 2.8669 1.3961 2.2213 6.2116 1.6650 5.2200 1.4540 1.3980 8.4896 1.3269 1.9854 3.3597 4.6605 1.2218 2.2652 2.8139 2.0880 1.9332 3.8004 3.3994 3.2014 4.1358 2.9390 5.4925 7.1372 7.0865 1.0873 1.0929 1.0924 1.0993 1.0792
irintensity: 4.9726 0.0627 0.1208 10.2759 0.2169 0.5239 0.9369 1.2670 0.2766 11.4891 5.0839 7.6582 0.9559 6.7805 17.3590 101.4557 18.1220 12.1117 64.8695 10.0793 25.8442 0.2342 6.0197 2.0509 17.3042 27.9648 50.6670 10.2943 17.1710 5.3463 1.7188 31.2066 64.4423 34.5287 19.2002 45.1824 16.1113 248.7458 49.3803 8.1323 3.6610 1.8993 1.5666 6.1523 110.7162
temp: 298.150 k
press: 1.00000 atm
elementType: 9 8 7 7 6 6 6 6 6 6 6 6 1 1 1 1 1
symmnumber: 1
zpe: 308378.3 jmol-1
zpe.correction: 0.117455 hartree
zpe.thermalcorrener: 0.126234 hartree
zpe.thermalcorrenthalpy: 0.127178 hartree
zpe.thermalcorrgfe: 0.083423 hartree
zpe.sumelectzpe: -591.572348 hartree
zpe.sumelectthermal: -591.563569 hartree
zpe.sumelectthermalent: -591.562625 hartree
zpe.sumelectthermalfe: -591.606381 hartree
dipole: -3.8643 -0.6099 0.0008
dipole: 3.9121
quadrupole: -72.7088 -66.1577 -69.4999
quadrupole: -9.2109 0.0023 0.0003
quadrupole: -3.2533 3.2977 -0.0444 -9.2109 0.0023 0.0003
hfenergy: -591.6898031 hartree
pointgroup: C01 [X(C8H5F1N2O1)]
dipole: 1.4878171 0.3941971 0.0003251 debye
dipolederiv: -0.4358959 -0.3090366 -0.0000689 -0.4358133 -0.8357325 -0.0001339 -0.000097 -0.0001493 -0.1312834 -0.7331772 -0.2488281 -0.0000629 -0.5104749 -0.8170615 -0.0001093 -0.0000856 -0.0000647 -0.366247 -0.8548191 -0.0762028 -0.0000813 0.2896296 -0.5022935 0.0000018 0.0000758 0.0000355 -0.2195147 0.7922646 0.3431369 0.0001653 0.3244097 -0.0785171 0.0001034 0.0001041 -0.0000096 -0.1437313 -0.4759933 -0.2476672 -0.0000607 0.0144392 -0.0146729 -0.0000052 -0.0000681 -0.0000464 0.005489 0.1249887 -0.4623419 -0.0000313 -0.2952089 0.3655875 -0.0000246 -0.0000609 -0.0000401 0.0770849 -0.0066992 0.1961029 0.0000332 -0.0811529 -0.0107353 0.0000104 -0.0000056 0.000034 -0.1238673 0.4295336 0.6125672 0.0001077 0.5211572 0.8069945 0.0001606 0.0001074 0.0002146 0.0756688 0.8219141 0.2265915 0.0000836 0.5819259 0.90382 0.000141 0.0001968 0.0000987 0.2350349 -0.0943771 -0.2019277 -0.0000079 -0.0420831 0.0385547 0.0000116 0.0000156 -0.0000031 -0.1588985 0.0258901 0.0452017 0.0000219 0.0295394 -0.002509 0.0000041 0.0000088 0.0000066 -0.1344659 0.1708384 0.1096442 -0.0000473 -0.5119963 -0.3770465 -0.0001163 -0.0002148 -0.0000069 -0.1083294 0.0907531 -0.0756934 -0.0000167 -0.0021105 0.0373744 -0.0000134 -0.0000098 -0.0000189 0.1627449 0.1670574 0.0144532 -0.0000168 0.0514418 0.3176871 0.0000023 -0.0000175 -0.0000266 0.3356972 -0.0289362 -0.0231164 -0.000024 -0.0129094 0.1124986 -0.0000068 -0.0000268 -0.0000127 0.1795651 0.0281744 0.0791649 -0.0000063 0.0815708 -0.0278435 -0.00001 -0.0000029 -0.0000072 0.1658043 -0.0215162 0.0179518 0.0000125 -0.0023644 0.0838949 -0.0000156 0.0000804 -0.0000039 0.1492485 unknown
polarizability: 145.1979153|-0.35755|119.0010749|0.0100411|0.0092207|40.7247535 unknown
InChI: InChI=1S/C8H5FN2O/c9-6-3-1-2-5-7(12)4-10-11-8(5)6/h1-4,11H
charge 0 multiplicity 1
17 atoms
F  2.362258 1.89008 0.000343
O  -2.500241 -1.780007 -0.000587
N  -0.419307 1.757631 0.000017
N  -1.791008 1.804772 -0.000081
C  -0.327519 -0.681186 -0.00026
C  0.331906 0.58457 -0.000036
C  0.449177 -1.87046 -0.000318
C  1.750285 0.615561 0.000085
C  -1.813513 -0.704801 -0.00043
C  1.852564 -1.805458 -0.000152
C  2.518294 -0.544893 0.000031
C  -2.437355 0.633468 -0.000327
H  -0.085487 -2.825241 -0.000477
H  0.041531 2.66806 0.000245
H  3.609926 -0.472168 0.000154
H  2.44973 -2.722055 -0.000165
H  -3.529343 0.702426 -0.000045
