program: Gaussian 09
title: 000270896
version: EM64L-G09RevD.01
frameworkgroup: C1[X(C12H6N4)]
method: RPBEPBE
basis: SDD
operation: Freq
keyword: #pfreq=noraman
keyword: PBEPBE/SDD
title: #p freq=noraman PBEPBE/SDD
converged: NO NO NO NO
title: Mulliken charges:
elementType: N N N N C C C C C C C C C C C C H H H H H H
charge: -0.078034 -0.078034 -0.078034 -0.078033 0.262487 0.262487 -0.027721 -0.027720 -0.027719 -0.027720 -0.322003 -0.322004 -0.322004 -0.322003 -0.185841 -0.185841 0.268143 0.268143 0.268143 0.268142 0.242584 0.242584
chargesum: 0.00000
title: Mulliken charges with hydrogens summed into heavy atoms:
elementType: N N N N C C C C C C C C C C C C
charge: -0.078034 -0.078034 -0.078034 -0.078033 0.262487 0.262487 -0.027721 -0.027720 -0.027719 -0.027720 -0.053861 -0.053861 -0.053861 -0.053861 0.056743 0.056743
polarizability: 2.62943997e+02 -9.97410846e-07 1.68797579e+02 2.45427809e-05 -3.42509116e-04 5.93898301e+01
1716.lowfreq: -12.4292 -0.0010 0.0003 0.0006 4.9456 14.4093 92.7940 162.5586 195.9024
frequency: 92.7940 162.5586 195.9024 241.4393 266.8485 343.9458 418.7482 424.5093 462.5093 474.9581 476.2608 483.7177 502.5356 520.3255 549.8015 555.6406 593.7329 690.4891 709.9016 717.7893 748.6046 788.0730 791.4211 812.3334 814.2960 846.9306 924.1425 941.0007 941.4494 996.7653 999.5865 1000.7856 1013.4624 1038.2110 1062.5452 1129.0786 1148.2227 1169.6078 1170.4438 1209.9712 1212.0647 1223.9024 1250.9830 1327.6456 1404.6053 1409.1226 1414.8424 1437.9685 1463.1394 1517.7345 1547.0159 1577.7904 1599.8310 1621.1640 3148.2827 3148.4930 3166.6676 3166.7209 3177.7322 3177.8828
redmass: 5.3941 4.7987 9.6801 4.9226 5.5113 4.7150 8.9841 5.3332 9.1888 3.8079 9.3422 6.4355 6.0319 5.1311 7.8166 9.1556 4.1859 8.4010 3.0026 7.2405 6.2703 1.6552 5.8720 1.5052 12.4977 3.4359 7.1427 1.4361 1.3836 7.0692 1.3629 1.3601 7.7195 1.9246 1.6080 8.6171 2.3219 1.6410 1.1733 6.7745 3.0106 8.5351 1.7426 2.7491 4.8708 2.5964 2.9134 7.5095 3.1428 5.3506 6.4656 8.0673 8.1447 10.4774 1.0877 1.0877 1.0924 1.0924 1.0986 1.0984
irintensity: 10.1512 0.0000 4.0907 0.0000 0.0000 6.4384 0.0000 0.0000 0.0000 1.7583 0.3110 0.0000 0.0000 0.0000 1.8488 0.0000 0.0000 2.9123 24.9398 0.0000 0.0000 0.0000 0.0000 142.1432 5.1113 0.0000 14.0475 0.0000 0.0000 1.5584 2.0885 0.0000 0.0000 0.0000 22.1345 0.0000 29.7390 2.2544 0.0000 14.9166 41.9723 0.0000 0.0000 0.0000 2.3612 9.3857 11.9555 0.0000 0.0000 0.0000 22.5120 0.0000 0.9450 0.0000 12.1194 0.0000 0.0000 2.0137 27.3656 0.0000
temp: 298.150 k
press: 1.00000 atm
elementType: 7 7 7 7 6 6 6 6 6 6 6 6 6 6 6 6 1 1 1 1 1 1
symmnumber: 1
zpe: 403290.6 jmol-1
zpe.correction: 0.153605 hartree
zpe.thermalcorrener: 0.163585 hartree
zpe.thermalcorrenthalpy: 0.164529 hartree
zpe.thermalcorrgfe: 0.118193 hartree
zpe.sumelectzpe: -678.777549 hartree
zpe.sumelectthermal: -678.767570 hartree
zpe.sumelectthermalent: -678.766626 hartree
zpe.sumelectthermalfe: -678.812961 hartree
dipole: 0.0000 0.0000 0.0000
dipole: 0.0000
quadrupole: -62.8329 -113.0406 -92.6484
quadrupole: 0.0000 0.0001 0.0001
quadrupole: 26.6744 -23.5333 -3.1411 0.0000 0.0001 0.0001
hfenergy: -678.9311547 hartree
pointgroup: C01 [X(C12H6N4)]
dipole: 0.0000006 -0.0000017 -0.000008 debye
dipolederiv: -0.0553879 -0.4173048 -0.0000091 -0.1754102 0.1568331 -0.0000086 -0.0000001 -0.0000001 -0.2304486 -0.0554015 0.4172999 -0.000008 0.1754053 0.1568457 0.0000106 -0.0000005 0.0000023 -0.2304488 -0.0554012 0.4173023 -0.000002 0.1754062 0.1568465 0.0000037 0.0000008 0.0000005 -0.2304487 -0.0553875 -0.4173068 -0.0000061 -0.1754112 0.1568336 -0.000003 -0.0000019 -0.0000009 -0.2304484 -0.0899402 -0.0000013 -0.0000006 -0.0000015 -0.00819 0.0000034 -0.0000105 0.0000032 0.0707646 -0.0899405 -0.0000007 -0.0000018 -0.0000001 -0.00819 -0.0000022 -0.0000115 -0.000004 0.0707648 -0.0916277 0.0016194 0.0000092 0.0304994 -0.2921061 -0.0000053 0.0000116 -0.0000045 0.1381838 -0.0916264 -0.0016148 0.0000111 -0.0304947 -0.2921068 0.0000025 0.000009 0.0000027 0.138184 -0.0916276 -0.0016156 0.0000037 -0.0304952 -0.2921071 -0.0000002 0.0000035 0.0000039 0.1381841 -0.0916287 0.0016199 0.0000054 0.0304998 -0.2921062 -0.0000017 0.0000054 -0.000003 0.1381839 0.0533439 -0.0356905 -0.0000032 0.1141575 0.2143101 -0.0000007 -0.0000097 0. -0.1073396 0.0533452 0.0356873 -0.0000007 -0.1141612 0.2143084 0.0000007 -0.000004 -0.0000006 -0.1073397 0.0533454 0.0356874 -0.0000006 -0.1141609 0.2143084 0.0000026 0.0000013 0.0000004 -0.1073395 0.0533439 -0.0356908 0.0000006 0.1141576 0.2143104 -0.0000002 0.0000016 0.0000011 -0.1073395 0.2413196 0.0000055 0. 0.0000057 -0.266933 0. -0.0000012 0.000002 -0.1622115 0.2413194 0.0000055 0.0000012 0.0000057 -0.266933 0. -0.0000014 -0.0000017 -0.1622116 0.0757899 -0.0337583 0.0000007 -0.0768666 0.0106604 0. 0.0000039 0.0000027 0.1664288 0.0757877 0.0337596 0. 0.0768681 0.0106629 0.0000003 0.0000025 -0.0000026 0.1664288 0.0757875 0.0337597 0. 0.076868 0.0106629 -0.0000008 0.000001 -0.0000025 0.1664288 0.0757898 -0.0337584 -0.0000003 -0.0768668 0.0106601 -0.0000007 0.0000007 0.0000017 0.1664288 -0.1156017 -0.0000023 0.0000009 -0.0000023 0.0957148 -0.0000001 0.0000004 -0.0000013 0.1577977 -0.1156014 -0.0000023 -0.0000002 -0.0000026 0.0957148 0. -0.0000007 0.000001 0.1577978 unknown
polarizability: 262.9439974|0.0010354|168.7975785|0.0000245|0.0003425|59.3898301 unknown
InChI: InChI=1S/C12H6N4/c1-3-7-11-8(4-1)14-16-10-6-2-5-9(12(10)11)15-13-7/h1-6H
charge 0 multiplicity 1
22 atoms
N  0.666648 2.489953 0.00001
N  -0.666704 2.489938 0.000058
N  0.666703 -2.489947 0.000008
N  -0.666648 -2.489962 0.000031
C  0.705722 0.000003 0.000022
C  -0.705722 -0.000012 0.000038
C  1.386347 1.250789 0.000029
C  -1.386375 1.250758 0.000033
C  1.386375 -1.250767 0.000011
C  -1.386347 -1.250798 0.00003
C  2.802808 1.241599 0.000032
C  -2.802835 1.241537 0.000019
C  2.802835 -1.241546 0.00002
C  -2.802807 -1.241608 0.000015
C  3.490593 0.000034 0.000019
C  -3.490593 -0.000043 0.00002
H  3.341712 2.194226 0.000028
H  -3.34176 2.194152 0.000018
H  3.34176 -2.194161 0.000018
H  -3.341711 -2.194235 0.000009
H  4.585453 0.000046 0.000012
H  -4.585453 -0.000056 0.000022
