program: Gaussian 09
title: 000270895
version: EM64L-G09RevD.01
frameworkgroup: C1[X(C18H22N6O2)]
method: RPBEPBE
basis: SDD
operation: Freq
keyword: #p
keyword: freq=noraman
keyword: PBEPBE/SDD
title: #p freq=noraman PBEPBE/SDD
converged: YES YES NO NO
title: Mulliken charges:
elementType: O O N N N N N N C C C C C C C C C C C C C C C C C C H H H H H H H H H H H H H H H H H H H H H H
charge: -0.277231 -0.254023 -0.398972 -0.058137 -0.069194 -0.084124 -0.092865 -0.447992 -0.104006 -0.047826 -0.497127 -0.447163 -0.465664 -0.420054 -0.007394 0.248777 -0.778209 -0.035007 0.329250 -0.577047 -0.371025 0.510290 -0.204241 -0.354592 0.215784 -0.799142 0.251681 0.266729 0.233049 0.259581 0.231941 0.216505 0.221431 0.211882 0.187870 0.217457 0.298745 0.254193 0.254157 0.207827 0.275335 0.283814 0.233857 0.315286 0.317289 0.238807 0.270228 0.239273
chargesum: 0.00000
title: Mulliken charges with hydrogens summed into heavy atoms:
elementType: O O N N N N N N C C C C C C C C C C C C C C C C C C
charge: -0.277231 -0.254023 -0.100228 -0.058137 -0.069194 -0.084124 -0.092865 -0.130703 0.147675 0.218902 -0.004497 0.001282 -0.032352 -0.014727 -0.007394 0.248777 -0.062032 -0.035007 0.329250 -0.301712 -0.087211 0.510290 0.029616 -0.039306 0.215784 -0.050835
polarizability: 4.17579436e+02 7.98165126e+00 2.29310567e+02 2.27890083e+01 -1.80486586e+01 1.69282754e+02
1716.lowfreq: -74.6233 -10.8558 -3.7339 -2.4624 -0.0011 0.0005 0.0006 7.6544 11.3544
frequency: -74.6221 -4.2567 11.2478 31.5648 38.9548 48.4133 54.7016 63.9378 84.1363 89.7068 93.5325 108.7354 130.6350 162.4597 165.5694 182.5430 200.7034 218.2901 247.2769 252.9919 292.0269 296.8852 329.0365 343.2115 364.0522 365.8342 410.7279 431.8496 446.0022 455.0463 477.3827 490.5559 515.7890 524.1456 527.3738 580.0911 585.8609 598.4399 619.4531 627.5722 639.0702 649.1762 664.2112 685.7984 705.3915 743.9478 777.0720 808.7636 818.3316 831.9724 842.2536 846.4630 868.6852 888.4596 897.0932 921.2156 923.6573 925.8365 941.8784 955.7936 970.5741 975.3754 982.5040 990.4316 994.9493 1011.5728 1026.8486 1032.7542 1041.5493 1050.0832 1056.2948 1061.0041 1085.1258 1094.1461 1115.6444 1150.5709 1161.3297 1179.7582 1185.2439 1205.4928 1230.4102 1241.5378 1244.9772 1261.8061 1266.6114 1270.7242 1297.8769 1309.8671 1312.5563 1320.6865 1331.7774 1344.9177 1345.6221 1355.7279 1367.0188 1372.3380 1376.0833 1378.1671 1387.8622 1392.2401 1421.6343 1449.8116 1451.9989 1453.7825 1460.2818 1463.1812 1468.1149 1471.2356 1475.8286 1483.0701 1484.7614 1522.9174 1592.3929 1613.1006 1614.7253 1636.4807 2960.2481 2984.8731 2986.5623 2988.5815 2994.8853 2997.3860 3007.2300 3021.3389 3033.2815 3045.4175 3052.7160 3069.0864 3073.5699 3094.9355 3100.4926 3135.4132 3137.3363 3147.0925 3178.9932 3196.2303 3520.9695 3551.9948
redmass: 1.0463 7.3560 4.6656 5.1400 5.5344 8.5345 6.7953 4.4168 1.8700 1.6586 3.2532 4.0052 4.0423 5.1062 4.9992 4.5238 3.7155 4.4570 2.7629 3.7735 12.1004 4.4787 3.4560 2.8558 4.5707 5.2634 3.3405 2.7485 3.6540 3.1638 2.1873 3.5534 1.5922 3.5470 4.0410 3.2636 3.4644 3.1943 3.2195 4.5074 5.3602 4.9823 1.6714 4.4815 2.1000 3.9466 3.1647 4.2324 3.2256 1.7228 1.7975 3.9045 2.9703 2.5261 2.2353 2.5642 3.1553 2.1547 5.6694 1.3756 1.9559 7.5818 3.4324 2.8212 2.2876 1.3424 1.9064 1.6626 1.6473 1.5676 2.2784 2.0259 1.6898 1.6716 2.9478 1.6459 2.3716 1.1238 1.6567 2.5640 2.3488 1.5921 1.7846 1.4144 1.6402 2.5526 1.6159 1.3466 1.5955 1.4621 1.6148 1.5238 1.8777 1.9040 1.5491 3.8395 3.3521 1.2474 1.2341 7.3924 3.1420 1.0736 1.1770 1.1926 1.2539 1.0864 1.0465 1.1831 1.0984 1.2598 2.9612 2.1646 5.8110 6.3422 6.3115 5.0769 1.0663 1.0606 1.0617 1.0385 1.0363 1.0658 1.0794 1.0837 1.0934 1.1027 1.1029 1.1021 1.0983 1.0997 1.0988 1.0919 1.0979 1.0890 1.0949 1.0957 1.0766 1.0778
irintensity: 0.0468 0.6278 1.0329 1.2317 5.8499 4.6805 7.4047 5.6715 3.7158 1.4734 2.6981 4.4612 1.1290 5.6109 4.2826 6.4250 7.3133 2.3204 1.1768 0.5930 0.0232 0.1268 1.3429 0.5781 1.1446 4.8227 3.6603 3.7319 2.8295 5.4566 3.8370 8.6457 87.6366 49.0253 15.3875 0.2363 6.3882 5.3135 2.4204 2.1990 1.0201 2.0895 59.2056 0.9403 48.8180 3.8690 0.9181 15.9410 0.5082 23.4484 6.7834 7.5592 1.0264 8.4432 5.4293 14.2570 24.0917 28.3316 13.8060 0.1023 5.3961 71.5587 1.6938 9.7670 75.1953 3.6281 1.2831 7.8942 14.9612 1.2925 2.5354 6.1499 2.4995 16.6638 3.4690 4.6548 23.0264 2.9589 3.2771 21.5778 71.5872 19.0673 25.2132 10.1073 43.0510 24.3129 24.0813 14.6026 121.3506 6.7680 33.7500 0.8452 2.0477 20.1805 25.3457 527.9244 37.3161 64.0259 61.3033 9.9030 2.5472 39.7926 62.7046 101.3986 126.7672 7.9399 20.2898 23.1427 54.7662 63.1040 167.5354 383.7730 13.6043 166.8011 52.0207 154.5520 43.6266 14.7330 30.5775 7.0357 13.0898 2.5193 14.9120 23.1058 62.9995 27.2243 47.8861 18.7071 14.0852 18.0039 12.8424 9.6889 6.6880 15.2776 6.7255 7.9385 12.0516 13.7650
temp: 298.150 k
press: 1.00000 atm
elementType: 8 8 7 7 7 7 7 7 6 6 6 6 6 6 6 6 6 6 6 6 6 6 6 6 6 6 1 1 1 1 1 1 1 1 1 1 1 1 1 1 1 1 1 1 1 1 1 1
symmnumber: 1
zpe: 1004407.5 jmol-1
zpe.correction: 0.382559 hartree
zpe.thermalcorrener: 0.405813 hartree
zpe.thermalcorrenthalpy: 0.406757 hartree
zpe.thermalcorrgfe: 0.327162 hartree
zpe.sumelectzpe: -1176.132717 hartree
zpe.sumelectthermal: -1176.109463 hartree
zpe.sumelectthermalent: -1176.108519 hartree
zpe.sumelectthermalfe: -1176.188114 hartree
dipole: -2.4553 -3.9637 -2.4110
dipole: 5.2491
quadrupole: -146.1618 -144.7567 -163.8949
quadrupole: -12.5614 25.8571 -5.6511
quadrupole: 5.4426 6.8477 -12.2904 -12.5614 25.8571 -5.6511
hfenergy: -1176.5152756 hartree
pointgroup: C01[X(C18H22N6O2)]
dipole: -0.9796343 0.6193409 -1.7092604 debye
polarizability: 417.0799662|-24.5616681|180.119212|10.231976|28.863274|218.9735794 unknown
InChI: InChI=1S/C18H22N6O2/c1-11(25)19-15-7-3-5-13(9-15)17-21-23-18(24-22-17)14-6-4-8-16(10-14)20-12(2)26/h3,5,7,9,14,16,19-20H,4,6,8,10H2,1-2H3
charge 0 multiplicity 1
48 atoms
O  -5.619366 -2.228078 1.674273
O  7.729749 -0.704819 0.210025
N  -5.853167 -0.335997 0.35056
N  -1.077655 1.435157 0.883773
N  -0.685832 0.030686 -1.078976
N  0.262108 1.433631 1.153746
N  0.649955 0.024417 -0.813128
N  5.602888 -0.949309 -0.757563
C  -3.002847 0.643801 -0.459677
C  -5.047927 -0.888409 -0.763821
C  -3.527293 -0.819865 -0.459276
C  -3.336268 1.344452 -1.812123
C  -5.388542 -0.155279 -2.081932
C  -4.852498 1.297849 -2.106422
C  -1.521719 0.689487 -0.193158
C  -6.091122 -1.060397 1.50784
C  -6.951128 -0.36877 2.562957
C  1.087929 0.681089 0.331685
C  2.522971 0.610694 0.663896
C  3.40122 -0.121045 -0.172572
C  3.027702 1.274372 1.815031
C  4.782569 -0.19747 0.129477
C  4.403137 1.191106 2.106572
C  5.290752 0.465991 1.281644
C  6.984314 -1.171237 -0.698962
C  7.514336 -2.034602 -1.843753
H  -3.486753 1.202535 0.364926
H  -5.320439 -1.957747 -0.842841
H  -2.9815 -1.398656 -1.229149
H  -3.34109 -1.304432 0.5156
H  -2.778872 0.830497 -2.619279
H  -2.985453 2.393708 -1.786383
H  -6.482209 -0.174485 -2.25209
H  -4.922514 -0.719372 -2.912908
H  -5.391284 1.926439 -1.365775
H  -5.054152 1.751867 -3.095004
H  -6.254346 0.597591 0.251681
H  -7.802206 -1.023368 2.817084
H  -6.356482 -0.23481 3.483364
H  -7.338887 0.614724 2.244347
H  2.98477 -0.619765 -1.055658
H  2.339859 1.838254 2.450448
H  4.799968 1.699154 2.991883
H  6.356636 0.403387 1.507033
H  5.111216 -1.380875 -1.544337
H  7.034512 -3.030856 -1.852496
H  8.597552 -2.165274 -1.710669
H  7.33241 -1.556874 -2.824392
