program: Gaussian 09
title: 000270894
version: EM64L-G09RevD.01
frameworkgroup: C1[X(C14H14N6)]
method: RPBEPBE
basis: SDD
operation: Freq
keyword: #pfreq=noraman
keyword: PBEPBE/SDD
title: #p freq=noraman PBEPBE/SDD
converged: YES YES NO NO
title: Mulliken charges:
elementType: N N N N N N C C C C C C C C C C C C C C H H H H H H H H H H H H H H
charge: -0.470628 -0.470627 -0.448741 -0.448739 -0.159339 -0.159339 0.446169 0.446166 0.307433 0.307434 -0.448455 -0.448454 -0.332753 -0.332752 -0.198959 -0.198959 -0.224551 -0.224553 -0.259116 -0.259116 0.297806 0.297806 0.215088 0.215088 0.311852 0.311855 0.290628 0.290628 0.224285 0.224285 0.222245 0.222245 0.227034 0.227034
chargesum: 0.00000
title: Mulliken charges with hydrogens summed into heavy atoms:
elementType: N N N N N N C C C C C C C C C C C C C C
charge: -0.172821 -0.172821 -0.158113 -0.158111 -0.159339 -0.159339 0.446169 0.446166 0.307433 0.307434 -0.233367 -0.233366 -0.020901 -0.020897 0.025326 0.025327 -0.002306 -0.002308 -0.032082 -0.032082
polarizability: 3.76836785e+02 5.27036410e-01 1.91224668e+02 9.30688917e-05 1.12921608e-04 8.14675509e+01
1716.lowfreq: -8.3155 -6.3180 -0.0006 -0.0001 0.0008 1.8661 17.4993 38.1646 43.4144
frequency: 17.4497 38.1504 43.4076 58.3820 82.9280 116.8574 131.0001 209.6930 228.9642 248.2367 255.7266 291.4347 323.0512 341.7073 361.2990 380.8975 393.0629 409.6980 409.7493 481.9165 482.6737 514.8057 525.8556 553.2423 573.3999 592.5504 610.6238 614.3536 618.5578 687.0994 695.0744 695.5667 706.3148 760.5822 761.2132 779.7497 826.9510 837.8890 837.9422 861.4810 879.5604 909.0978 909.4586 951.9665 967.6745 967.6924 983.8405 984.1664 995.9875 996.1154 1025.7178 1027.4073 1054.8538 1062.3650 1089.6644 1095.0226 1171.3039 1171.3330 1189.0383 1189.1926 1227.9362 1250.2041 1273.2047 1287.5456 1331.2538 1334.4844 1373.7980 1387.2922 1392.6998 1424.6812 1439.2044 1450.4327 1484.5769 1485.3024 1526.8839 1539.1619 1586.3019 1599.6546 1602.3317 1615.7844 1618.7482 1638.8073 3106.4306 3106.4419 3129.9860 3130.0092 3141.9438 3141.9644 3164.2833 3164.3497 3181.3482 3181.4308 3545.4716 3545.7401 3568.5810 3570.5542
redmass: 6.2936 3.6764 5.1198 5.1150 5.3914 5.6218 5.7812 4.4233 4.9089 5.4380 3.7058 4.3777 5.2950 6.2698 6.9288 1.3221 1.4747 2.9103 2.9037 1.6583 1.4459 3.3548 2.1287 3.0169 6.0337 7.6072 6.5549 6.4625 6.8003 5.3041 2.1907 2.0186 5.9373 1.6881 1.6712 5.6006 5.1868 1.2717 1.2948 6.0166 6.3939 1.4201 1.4201 5.8043 1.3515 1.3514 5.9159 5.9347 1.3108 1.3103 2.2574 2.1011 5.0023 4.1104 1.5892 1.8539 1.0508 1.0509 1.1149 1.1123 2.9119 2.8079 1.6893 1.8959 1.3891 1.4389 1.5570 4.6488 7.6314 1.8080 2.5436 2.0395 2.3154 2.2891 2.4231 2.5575 7.1609 5.4695 3.9844 5.9086 6.0245 3.5300 1.0884 1.0884 1.0865 1.0865 1.0932 1.0932 1.0990 1.0990 1.0960 1.0960 1.0757 1.0758 1.0785 1.0788
irintensity: 0.1153 0.3352 0.3347 0.0549 1.2275 0.0097 0.2658 1.5494 0.2088 7.0665 0.0289 32.9764 12.8465 0.0218 3.7664 31.1336 38.5145 0.5372 0.8377 193.9271 13.4419 12.8665 4.5046 159.5299 18.6009 1.5158 4.8397 0.1415 3.8598 12.2806 78.0548 1.1552 17.6769 0.7300 179.8660 26.5837 2.3964 0.0855 0.4412 4.6940 14.1839 0.3658 26.6036 75.8879 0.2245 0.0039 0.0002 3.1389 0.0258 5.3241 0.3904 20.0135 10.1540 1.2709 25.5130 0.3337 0.9476 0.0157 0.0008 4.5144 3.5787 40.2234 0.8482 170.0365 1.7473 117.6000 90.9927 1.6587 262.1891 0.0814 257.6060 3.7315 158.4067 0.6899 1183.8735 16.3239 8.0126 122.5360 0.0534 242.9911 1.8582 113.3068 0.1027 33.2657 1.0446 0.0270 0.2318 66.1794 52.3900 0.5477 30.9313 0.4328 35.0801 1.5548 43.4264 0.7141
temp: 298.150 k
press: 1.00000 atm
elementType: 7 7 7 7 7 7 6 6 6 6 6 6 6 6 6 6 6 6 6 6 1 1 1 1 1 1 1 1 1 1 1 1 1 1
symmnumber: 1
zpe: 697003.1 jmol-1
zpe.correction: 0.265474 hartree
zpe.thermalcorrener: 0.282418 hartree
zpe.thermalcorrenthalpy: 0.283363 hartree
zpe.thermalcorrgfe: 0.219180 hartree
zpe.sumelectzpe: -868.927583 hartree
zpe.sumelectthermal: -868.910639 hartree
zpe.sumelectthermalent: -868.909695 hartree
zpe.sumelectthermalfe: -868.973877 hartree
dipole: 0.0000 0.0000 -0.2847
dipole: 0.2847
quadrupole: -107.5919 -93.1452 -127.5378
quadrupole: -12.2651 0.0000 0.0001
quadrupole: 1.8331 16.2797 -18.1128 -12.2651 0.0000 0.0001
hfenergy: -869.1930571 hartree
pointgroup: C01 [X(C14H14N6)]
dipole: -0.0000177 0.1120032 -0.000045 debye
polarizability: 376.7271872|0.0260786|81.4675693|4.5395946|0.0424552|191.3342469 unknown
InChI: InChI=1S/C14H14N6/c1-3-7-11(8-4-1)15-13-17-19-14(20-18-13)16-12-9-5-2-6-10-12/h1-10,15-17,20H
charge 0 multiplicity 1
34 atoms
N  2.534529 -0.191905 -0.947973
N  -2.534531 -0.191591 0.948119
N  0.273312 -0.882511 -1.231345
N  -0.273197 -0.881596 1.232033
N  -1.077375 -0.401043 -0.947474
N  1.077408 -0.400119 0.947785
C  3.808576 -0.043794 -0.337032
C  -3.808598 -0.044155 0.337055
C  1.305946 -0.490737 -0.362031
C  -1.305898 -0.490675 0.362413
C  4.926955 0.135794 -1.198251
C  -4.927016 0.135903 1.198125
C  4.002414 -0.064747 1.069919
C  -4.002417 -0.066217 -1.069882
C  6.220676 0.285565 -0.661536
C  -6.220756 0.285044 0.661281
C  5.307602 0.075332 1.589374
C  -5.307623 0.073247 -1.589459
C  6.422306 0.252598 0.738749
C  -6.422366 0.250975 -0.73898
H  2.513394 -0.031055 -1.956243
H  -2.51343 -0.029967 1.956266
H  4.783253 0.150671 -2.287006
H  -4.783329 0.151631 2.28687
H  3.134962 -0.177305 1.72305
H  -3.134938 -0.17913 -1.722915
H  0.434832 -0.966051 -2.234577
H  -0.434703 -0.964367 2.235332
H  7.071462 0.423666 -1.338083
H  -7.071572 0.423518 1.337714
H  5.449659 0.055081 2.676034
H  -5.449664 0.052144 -2.676105
H  7.4282 0.367454 1.155834
H  -7.428275 0.365344 -1.156163
